{"text_format":"1","workbook":"xlsx","n_sheets":6,"sheets":["Questionnaire","CPA","DWP","Provider","Admin","Scoring"],"not_rendered":{"charts":0,"images":0,"macros":1,"external_links":0,"defined_names":3,"comments":0,"pivot_tables":0},"unopened":[],"bounds":{"document_bytes":16777216,"sheet_cells":100000,"rows_first":2000,"rows_last":500,"rows_between":2000,"halvings":0,"cell_chars":16384,"cell_head_chars":4096},"cells_cut":0,"cells_raw":0,"read":"whole","date_system":"1900"}

{"sheet":"Questionnaire","index":0,"n_rows":528,"n_cols":14,"rows_kept":528,"cut":false,"hidden":false,"merged":[[26,1,27,9],[124,1,124,7],[125,1,125,7],[126,1,126,7],[131,1,131,7],[132,1,132,7],[133,1,133,7],[134,1,134,7],[135,1,135,7],[100,1,100,7],[101,1,101,7],[102,1,102,7],[103,1,103,7],[104,1,104,7],[105,1,105,7],[106,1,106,7],[91,1,91,7],[92,1,92,7],[93,1,93,7],[94,1,94,7],[95,1,95,7],[96,1,96,7],[97,1,97,7],[98,1,98,7],[136,1,136,7],[120,1,120,7],[121,1,121,7],[107,1,107,7],[108,1,108,7],[109,1,109,7],[110,1,110,7],[111,1,111,7],[122,1,122,7],[123,1,123,7],[118,1,118,7],[119,1,119,7],[99,1,99,7],[82,1,82,7],[83,1,83,7],[84,1,84,7],[85,1,85,7],[86,1,86,7],[87,1,87,7],[88,1,88,7],[89,1,89,7],[90,1,90,7],[58,1,58,2],[59,1,59,2],[65,1,65,6],[66,1,66,6],[67,1,67,6],[63,7,63,8],[64,7,64,8],[65,7,65,8],[66,7,66,8],[67,7,67,8],[64,1,64,6],[144,1,144,7],[145,1,145,7],[146,1,146,7],[147,1,147,7],[148,1,148,7],[55,3,55,8],[50,1,50,2],[51,1,51,2],[52,1,52,2],[53,1,53,2],[54,1,54,2],[55,1,55,2],[50,3,50,8],[51,3,51,8],[52,3,52,8],[53,3,53,8],[54,3,54,8],[56,3,56,8],[57,3,57,8],[58,3,58,8],[59,3,59,8],[63,1,63,6],[56,1,56,2],[57,1,57,2],[154,1,154,7],[159,1,159,7],[160,1,160,7],[161,1,161,7],[162,1,162,7],[149,1,149,7],[150,1,150,7],[151,1,151,7],[152,1,152,7],[153,1,153,7],[173,1,173,7],[174,1,174,7],[175,1,175,7],[176,1,176,7],[163,1,163,7],[164,1,164,7],[170,1,170,7],[171,1,171,7],[172,1,172,7],[462,1,463,9],[414,3,414,8],[424,3,424,8],[428,3,428,8],[183,3,183,6],[185,3,185,6],[430,3,430,8],[416,3,416,8],[426,3,426,8],[418,3,418,8],[420,3,420,8],[458,1,458,5],[422,3,422,8],[447,4,447,7]]}
[null,null,null,null,null,null,null,null,null,null,"v5"]
[]
[null,"Reducing Parental Conflict Programme"]
[null,"Referral Stage Questionnaire "]
[null,"For parents expecting their first child who are  currently in a relationship"]
[null,"together"]
[]
[null,"Please read the following instructions."]
[]
[null,"Please could you answer all questions in Part 1 asking for information relating to you ",null,null,null,null,null,null,null,null,null,"Values"]
[null,"and your family."]
[]
[null,"Once you have provided your information please move on to Part 2. Please answer "]
[null,"all questions in this section."]
[]
[null,"Once completed please return the questionnaire to the person who gave it to "]
[null,"you"]
[]
[null,"Additional Needs (including any needs for interpreters etc.)"]
[]
[null,"I have no additional needs that might make it difficult for me to take part"]
[]
[null,"I have additional needs that might make it difficult for me to take part. "]
[null,"I have given details of these below:"]
[null,null,null,null,null,null,null,null,null,null,null,0,{"$f":"IF(L25=1, \"No Additional Needs Identified\", IF(L25=2, \"Additional Needs Identified\", \"Must Complete\"))","v":"Must Complete"}]
[null,"Please give details"]
[null,null,null,null,null,null,null,null,null,null,null,{"$f":"IF(B27>0, B27, \"Additional Needs not entered\")","v":"Additional Needs not entered"},{"$f":"IF(B27>0, \"Additional Needs Identified\", \"Additional Needs not entered\")","v":"Additional Needs not entered"}]
[]
[]
[null,"I have completed a separate Participation Agreement Statement with the person who "]
[null,"gave me the questionnaire",null,null,null,null,null,null,null,null,null,false,{"$f":"IF(L31=TRUE, \"Participation Agreement Completed\", \"Must Complete\")","v":"Must Complete"}]
[]
[null,"If you are completing a paper copy of this questionnaire, please select just one answer "]
[null,"for multiple choice questions."]
[]
[null,"Is anyone within your household currently in work?"]
[null,"Yes"]
[null,"No",null,null,null,null,null,null,null,null,null,0,{"$f":"IF(L38=1, \"Yes\", IF(L38=2, \"No\", \"Must Complete\"))","v":"Must Complete"}]
[]
[]
[]
[null,"PART 1"]
[]
[null,"Parent information"]
[]
[null,"This section collects important information about you and your family."]
[null,"Please complete all questions in this section."]
[]
[null,"About You"]
[]
[null,null,null,"Please complete below"]
[null,"Title",null,null,null,null,null,null,null,null,null,null,{"$f":"IF(D52>0, D52,\"Must Complete\")","v":"Must Complete"}]
[null,"Forenames",null,null,null,null,null,null,null,null,null,null,"Must Complete"]
[null,"Surname",null,null,null,null,null,null,null,null,null,null,"Must Complete"]
[null,"Date of birth\n(dd/mm/yyyy)",null,null,null,null,null,null,null,null,null,null,"Must Complete"]
[null,"Telephone\nnumber (mobile)",null,null,null,null,null,null,null,null,null,null,{"$f":"IF(D56>0,\"+44 \"& D56,\"Must Complete\")","v":"Must Complete"}]
[null,"Alternative\ntelephone \nnumber (e.g. landline)",null,null,null,null,null,null,null,null,null,null,{"$f":"IF(D57>0,  \"+44 \"&D57,\"No alternative number supplied\")","v":"No alternative number supplied"}]
[null,"Address",null,null,null,null,null,null,null,null,null,null,"Must Complete"]
[null,"Post code",null,null,null,null,null,null,null,null,null,null,"Must Complete"]
[null,"Email",null,null,null,null,null,null,null,null,null,null,{"$f":"IF(D60>0, D60,\"No email address supplied\")","v":"No email address supplied"}]
[]
[null,"What is your gender identity? Please select below."]
[]
[]
[null,"Male"]
[null,"Female"]
[null,"Other"]
[null,"Prefer not to say",null,null,null,null,null,null,null,null,null,0,{"$f":"IF(L68=0,\"Must Complete\",IF(L68=1,\"Prefer not to say\",IF(L68=2,\"Other\",IF(L68=3,\"Female\",IF(L68=4,\"Male\",\"INCORRECT\")))))","v":"Must Complete"}]
[]
[null,"Disability:"]
[null,"Do you have a long-standing physical or mental impairment, illness or disability? By "]
[null,"long-standing' we mean anything that has troubled you over a period of at least 12 "]
[null,"months or that is likely to trouble you over a period of at least 12 months."]
[]
[]
[null,"Yes",null,"No ",null,"Prefer not to say",null,null,null,null,null,0,{"$f":"IF(L76=0, \"Must Complete\", IF(L76=1, \"Prefer not to say\", IF(L76=2, \"No\", IF(L76=3, \"Yes\",\"Incorrect\"))))","v":"Must Complete"}]
[]
[]
[]
[null,"What is your ethnic group? Tick one option that best describes your ethnic group "]
[null,"or background."]
[]
[null,"White"]
[null,"    1.  English/Welsh/Scottish/Northern Irish/British"]
[null,"    2.  Irish"]
[null,"    3.  Gypsy or Irish Traveller"]
[null,"    4.  Any other white background. Please describe below:"]
[]
[null,"Mixed/ Multiple Ethnic Groups"]
[null,"    5.  White and Black Caribbean"]
[null,"    6.  White and Black African"]
[null,"    7.  White and Asian"]
[null,"    8.  Any other Mixed/Multiple ethnic background. Please \n         describe below:"]
[]
[null,"Asian/Asian British"]
[null,"    9.  Indian"]
[null,"    10. Pakistani"]
[null,"    11. Bangladeshi"]
[null,"    12. Chinese"]
[null,"    13. Any other Asian background. Please describe below:"]
[]
[null,"Black/African/Caribbean/Black British "]
[null,"    14. African"]
[null,"    15.  Caribbean"]
[null,"    16. Any other Black/African/Caribbean background. Please\n          describe below:"]
[]
[null,"Other ethnic group "]
[null,"    17. Arab"]
[null,"    18. Any other ethnic group. Please describe below:"]
[null,null,null,null,null,null,null,null,null,null,null,0]
[null,"    19. Prefer not to say",null,null,null,null,null,null,null,null,null,{"$f":"IF(L110=4, B88, IF(L110=8, B94, IF(L110=13,B101,  IF(L110=16, B106, IF(L110=18, B110, \"None Selected\")))))","v":"None Selected"},{"$f":"IF(L110>0,L110,\"Must Complete\")","v":"Must Complete"},{"$f":"IF(L110=0, \"None Selected\", IF(L111=\"None Selected\", \"Standard Ethnicity Type\",  IF(L111=0, \"Please Select/Enter Type\", L111)))","v":"None Selected"}]
[]
[]
[]
[null,"Please answer the following questions by selecting your answer."]
[]
[null,"What is your current marital status?"]
[]
[null,"Single (never married or been in a civil partnership)"]
[null,"Married or in a Civil Partnership and living with husband/wife"]
{"$rows_left_out":409}
{"sheet":"CPA","index":1,"n_rows":13,"n_cols":15,"rows_kept":13,"cut":false,"hidden":true,"merged":[]}
[]
[" Tab for CPA Admin Use Only"]
[]
[]
["Date RSQ Completed","Parent Name","Date of Birth","Phone Number","Practitioner","Role","Team","Service","Organisation","Email","Phone","LA","Workless Household","Support Level","PWC"]
[{"$f":"Questionnaire!M429","v":"Must Complete"},{"$f":"Questionnaire!M52&\" \"&Questionnaire!M53&\" \"&Questionnaire!M54","v":"Must Complete Must Complete Must Complete"},{"$f":"Questionnaire!M55","v":"Must Complete"},{"$f":"Questionnaire!M56","v":"Must Complete"},{"$f":"Questionnaire!M415","v":"Must Complete"},{"$f":"Questionnaire!M417","v":"Must Complete"},{"$f":"Questionnaire!M419","v":"Must Complete"},{"$f":"Questionnaire!M421","v":"Must Complete"},{"$f":"Questionnaire!M423","v":"Must Complete"},{"$f":"Questionnaire!M425","v":"Must Complete"},{"$f":"Questionnaire!M427","v":"Must Complete"},{"$f":"Questionnaire!M431","v":"Must Complete"},{"$f":"IF(Questionnaire!M38=\"Yes\", \"No\", IF(Questionnaire!M38=\"No\", \"Yes\", \"Not Completed\"))","v":"Not Completed"},{"$f":"Admin!B15","v":"Participation Statement not Completed DO NOT FORWARD"},"N/A"]
[null,null,null,null,null,null,null,null,"Enter UIN Below"]
[null,"Linked Co-Parent"]
[null,{"$f":"Questionnaire!M184","v":"Co-Parent details not supplied"},{"$f":"Questionnaire!M186","v":"Co-Parent details not supplied"},null,null,null,null,null,"TEST","*Copy and paste yellow cell data to UIN spreadsheet "]
[null,null,null,null,null,null,null,null,null,"to assign a UIN"]
[null,null,null,null,null," Use this button  to send the full RSQ to DWP"]
[null,null,null,null,null,null,null,null,"TEST2"]
[null,null,null,null,null," Use this button to send RSQ data to the Provider"]

{"sheet":"DWP","index":2,"n_rows":215,"n_cols":10,"rows_kept":215,"cut":false,"hidden":true,"merged":[[40,1,40,2],[40,3,40,8],[38,1,38,2],[38,3,38,8],[39,1,39,2],[39,3,39,8],[46,1,46,2],[46,3,46,8],[47,1,47,2],[47,3,47,8],[41,1,41,2],[41,3,41,8],[42,1,42,2],[42,3,42,8],[44,1,44,2],[44,3,44,8],[43,1,43,2],[43,3,43,8],[213,1,213,5],[214,1,214,5],[192,3,192,8],[194,3,194,8],[196,3,196,8],[198,3,198,8],[206,2,206,5],[23,1,24,9],[190,3,190,8],[210,1,210,5],[211,1,211,5],[212,1,212,5],[188,3,188,8],[76,3,76,6],[78,3,78,6],[184,3,184,8],[186,3,186,8],[48,1,48,2],[48,3,48,8],[52,1,52,6],[52,7,52,8],[45,1,45,2],[45,3,45,8]]}
[null,"Level of Support Required = ",null,null,{"$f":"Admin!B15","v":"Participation Statement not Completed DO NOT FORWARD"}]
[null,"Workless Household",null,{"$f":"CPA!M6","v":"Not Completed"}]
[]
[null,"Reducing Parental Conflict Programme"]
[null,"Referral Stage Questionnaire "]
[null,"For parents expecting their first child who are  currently in a relationship"]
[null,"together"]
[]
[null,"Please read the following instructions."]
[]
[null,"Please could you answer all questions in Part 1 asking for information relating to you "]
[null,"and your family."]
[]
[null,"Once you have provided your information please move on to Part 2. Please answer "]
[null,"all questions in this section."]
[]
[null,"Once completed please return the questionnaire to the person who gave it to "]
[null,"you"]
[]
[null,"Additional Needs - "]
[null,{"$f":"Questionnaire!M25","v":"Must Complete"}]
[]
[null,"Details"]
[null,{"$f":"Questionnaire!M27","v":"Additional Needs not entered"}]
[]
[]
[null,"Participation Agreement"]
[null,{"$f":"Questionnaire!M31","v":"Must Complete"}]
[]
[null,"PART 1"]
[]
[null,"Parent information"]
[]
[null,"This section collects important information about you and your family."]
[null,"Please complete all questions in this section."]
[]
[null,"About You"]
[]
[null,null,null,"Please complete below"]
[null,"Title",null,{"$f":"Questionnaire!M52","v":"Must Complete"}]
[null,"Forenames",null,{"$f":"Questionnaire!M53","v":"Must Complete"}]
[null,"Surname",null,{"$f":"Questionnaire!M54","v":"Must Complete"}]
[null,"Date of birth\n(dd/mm/yyyy)",null,{"$f":"Questionnaire!M55","v":"Must Complete"}]
[null,"UIN",null,{"$f":"CPA!I9","v":"TEST"}]
[null,"Telephone\nnumber (mobile)",null,{"$f":"Questionnaire!M56","v":"Must Complete"}]
[null,"Alternative\ntelephone \nnumber (e.g. landline)",null,{"$f":"Questionnaire!M57","v":"No alternative number supplied"}]
[null,"Address",null,{"$f":"Questionnaire!M58","v":"Must Complete"}]
[null,"Post code",null,{"$f":"Questionnaire!M59","v":"Must Complete"}]
[null,"Email",null,{"$f":"Questionnaire!M60","v":"No email address supplied"}]
[]
[null,"What is your gender identity? Please select below."]
[null,{"$f":"Questionnaire!M68","v":"Must Complete"}]
[]
[null,"Disability:"]
[null,{"$f":"Questionnaire!M76","v":"Must Complete"}]
[]
[null,"What is your ethnic group? "]
[null,{"$f":"Questionnaire!M111","v":"Must Complete"}]
[null,{"$f":"Questionnaire!N111","v":"None Selected"}]
[]
[null,"What is your marital status?"]
[null,{"$f":"Questionnaire!M127","v":"Must Complete"}]
[]
[null,"How many children do you have primary or shared care responsibility for?"]
[null,{"$f":"Questionnaire!M137","v":"Must Complete"}]
[]
[null,"Which of these best describes your current employment status?"]
[null,{"$f":"Questionnaire!M155","v":"Must Complete"}]
[]
[null,"Are you presently or have you ever experienced mental health problems? "]
[null,{"$f":"Questionnaire!M165","v":"Must Complete"}]
[]
[null,"What is your relationship with the person you are currently experiencing"]
[null,"conflict with? "]
[null,{"$f":"Questionnaire!M177","v":"Must Complete"}]
[]
[null,"Their name",null,{"$f":"Questionnaire!M184","v":"Co-Parent details not supplied"}]
[]
[null,"Their UIN",null,{"$f":"IF(CPA!I12>0, CPA!I12, \"INCOMPLETE\")","v":"TEST2"}]
[]
[]
[null,"PART 2"]
[null,"Questionnaire for parents expecting their first child who "]
[null,"are currently in a relationship together"]
[]
[null,"There are two sections of questions in this part of the questionnaire. Please answer "]
[null,"all questions to the best of your ability, even if they do not seem entirely relevant to "]
[null,"you. "]
[]
[null,"Once you have finished these questions, please return the questionnaire to the "]
[null,"person who gave it to you. "]
[]
[null,"Section 1:  You and your spouse/partner"]
[]
[null,"Please think about the times during the last 4 weeks when you and your spouse/partner"]
[null,"have spent time talking or doing things together."]
[]
[null,"With those times in mind, please indicate how often your spouse/partner acted in the "]
[null,"following ways towards you. During the past 4 weeks, how often did your "]
[null,"spouse/partner…",null,"Score from 1 (Always) to 7 (Never)"]
[]
[null,"1. Let you know they really care about you"]
[null,{"$f":"Questionnaire!M212","v":"Must Complete"}]
[]
[null,"2. Was loving and / or affectionate towards you"]
[null,{"$f":"Questionnaire!M218","v":"Must Complete"}]
[]
[null,"3. Let you know that they appreciate your ideas or the things you do"]
[null,{"$f":"Questionnaire!M224","v":"Must Complete"}]
[]
[null,"4. Help you to do something that is important to you"]
[null,{"$f":"Questionnaire!M230","v":"Must Complete"}]
[]
[null,"5. Be supportive and understanding towards you"]
[null,{"$f":"Questionnaire!M236","v":"Must Complete"}]
[]
[null,"6. Criticise you"]
[null,{"$f":"Questionnaire!M242","v":"Must Complete"}]
[]
[null,"7. Argue with you when you disagreed about something"]
{"$rows_left_out":96}
{"sheet":"Provider","index":3,"n_rows":175,"n_cols":6,"rows_kept":175,"cut":false,"hidden":true,"merged":[[41,1,41,2],[41,3,41,8],[43,1,43,2],[43,3,43,8],[23,1,24,9],[38,1,38,2],[38,3,38,8],[39,1,39,2],[39,3,39,8],[40,1,40,2],[40,3,40,8],[42,1,42,2],[42,3,42,8],[44,1,44,2],[44,3,44,8],[45,1,45,2],[45,3,45,8],[46,1,46,2],[46,3,46,8],[174,1,175,9],[168,3,168,8],[170,3,170,8],[47,1,47,2],[47,3,47,8],[60,3,60,6],[62,3,62,6],[166,3,166,8],[164,3,164,8]]}
[null,"Level of Support Required = ",null,null,{"$f":"Admin!B15","v":"Participation Statement not Completed DO NOT FORWARD"}]
[null,"Workless Household",null,{"$f":"CPA!M6","v":"Not Completed"}]
[]
[null,"Reducing Parental Conflict Programme"]
[null,"Referral Stage Questionnaire "]
[null,"For parents expecting their first child who are  currently in a relationship"]
[null,"together"]
[]
[null,"Please read the following instructions."]
[]
[null,"Please could you answer all questions in Part 1 asking for information relating to you "]
[null,"and your family."]
[]
[null,"Once you have provided your information please move on to Part 2. Please answer "]
[null,"all questions in this section."]
[]
[null,"Once completed please return the questionnaire to the person who gave it to "]
[null,"you"]
[]
[null,"Additional Needs - "]
[null,{"$f":"Questionnaire!M25","v":"Must Complete"}]
[]
[null,"Details"]
[null,{"$f":"IF(Questionnaire!B27>0, Questionnaire!B27, \"INCOMPLETE\")","v":"INCOMPLETE"}]
[]
[]
[null,"Participation Agreement"]
[null,{"$f":"Questionnaire!M31","v":"Must Complete"}]
[]
[null,"PART 1"]
[]
[null,"Parent information"]
[]
[null,"This section collects important information about you and your family."]
[null,"Please complete all questions in this section."]
[]
[null,"About You"]
[]
[null,null,null,"Please complete below"]
[null,"Title",null,{"$f":"Questionnaire!M52","v":"Must Complete"}]
[null,"Forenames",null,{"$f":"Questionnaire!M53","v":"Must Complete"}]
[null,"Surname",null,{"$f":"Questionnaire!M54","v":"Must Complete"}]
[null,"UIN",null,{"$f":"CPA!I9","v":"TEST"}]
[null,"Telephone\nnumber (mobile)",null,{"$f":"Questionnaire!M55","v":"Must Complete"}]
[null,"Alternative\ntelephone \nnumber (e.g. landline)",null,{"$f":"Questionnaire!M57","v":"No alternative number supplied"}]
[null,"Address",null,{"$f":"Questionnaire!M58","v":"Must Complete"}]
[null,"Post code",null,{"$f":"Questionnaire!M59","v":"Must Complete"}]
[null,"Email",null,{"$f":"Questionnaire!M60","v":"No email address supplied"}]
[]
[]
[null,"How many children do you have primary or shared care responsibility for?"]
[null,{"$f":"Questionnaire!M137","v":"Must Complete"}]
[]
[null,"Which of these best describes your current employment status?"]
[null,{"$f":"Questionnaire!M155","v":"Must Complete"}]
[]
[null,"What is your relationship with the person you are currently experiencing"]
[null,"conflict with? "]
[null,{"$f":"Questionnaire!M177","v":"Must Complete"}]
[]
[null,"Their name",null,{"$f":"Questionnaire!M184","v":"Co-Parent details not supplied"}]
[]
[null,"Their UIN",null,{"$f":"IF(CPA!I12>0, CPA!I12, \"INCOMPLETE\")","v":"TEST2"}]
[]
[]
[null,"PART 2 - About Your Circumstances"]
[]
[null,"There are two sections of questions in this part of the questionnaire. Please answer "]
[null,"all questions to the best of your ability, even if they do not seem entirely relevant to "]
[null,"you. "]
[]
[null,"Once you have finished these questions, please return the questionnaire to the "]
[null,"person who gave it to you. "]
[]
[null,"Section 1:  You and your spouse/partner"]
[]
[null,"Please think about the times during the last 4 weeks when you and your spouse/partner"]
[null,"have spent time talking or doing things together."]
[]
[null,"With those times in mind, please indicate how often your spouse/partner acted in the "]
[null,"following ways towards you. During the past 4 weeks, how often did your "]
[null,"spouse/partner…",null,"Score from 1 (Always) to 7 (Never)"]
[]
[null,"1. Let you know they really care about you"]
[null,{"$f":"Questionnaire!M212","v":"Must Complete"}]
[]
[null,"2. Was loving and / or affectionate towards you"]
[null,{"$f":"Questionnaire!M218","v":"Must Complete"}]
[]
[null,"3. Let you know that they appreciate your ideas or the things you do"]
[null,{"$f":"Questionnaire!M224","v":"Must Complete"}]
[]
[null,"4. Help you to do something that is important to you"]
[null,{"$f":"Questionnaire!M230","v":"Must Complete"}]
[]
[null,"5. Be supportive and understanding towards you"]
[null,{"$f":"Questionnaire!M236","v":"Must Complete"}]
[]
[null,"6. Criticise you"]
[null,{"$f":"Questionnaire!M242","v":"Must Complete"}]
[]
[null,"7. Argue with you when you disagreed about something"]
[null,{"$f":"Questionnaire!M248","v":"Must Complete"}]
[]
[null,"8. Get angry at you"]
[null,{"$f":"Questionnaire!M254","v":"Must Complete"}]
[]
[null,"9. Shout at you because they were upset with you"]
[null,{"$f":"Questionnaire!M260","v":"Must Complete"}]
[]
[null,"Section 2:  Agreement in relationships"]
[]
[null,"Most people have disagreements in their relationships. Please select how often you"]
[null,"and your spouse / partner agree or disagree about the following:"]
[null,"Scoring from 5(Always Agree) to 0(Always Disagree)"]
[]
[null,"1. Philosophy of life (Your approach to life)"]
[null,{"$f":"Questionnaire!M272","v":"Must Complete"}]
[]
[null,"2. Aims, goals, and things you believe are important"]
{"$rows_left_out":56}
{"sheet":"Admin","index":4,"n_rows":18,"n_cols":10,"rows_kept":18,"cut":false,"hidden":false,"merged":[]}
[]
["***** FOR ADMINISTRATION USE ONLY ******"]
[]
["CPA Email","rpcgateway@gateshead.gov.uk"]
[]
["DWP Email","RPC.REFERRALTEAM@DWP.GSI.GOV.UK"]
[]
["Provider Email","RPC@relate.org.uk"]
[]
[]
[]
[]
[]
[null,"Level Calculated"]
[null,{"$f":"IF(Questionnaire!L31=TRUE,Scoring!H37, \"Participation Statement not Completed DO NOT FORWARD\")","v":"Participation Statement not Completed DO NOT FORWARD"}]
[]
[]
[null,{"$f":"CPA!I9","v":"TEST"},null,null,null,null,null,null,null,{"$f":"CPA!I9","v":"TEST"}]

{"sheet":"Scoring","index":5,"n_rows":37,"n_cols":8,"rows_kept":37,"cut":false,"hidden":true,"merged":[]}
["Scoring "]
[]
["Interaction",null,"From Questionnaire","Numeric Value",null,"Conflict Level"]
["IOWA",1,{"$f":"Questionnaire!M212","v":"Must Complete"},{"$f":"IF(C4<>\"Must Complete\", C4, 0)","v":0},null,{"$f":"IF(D9>=33,\"High\",IF(D9>=25,\"Moderate\",IF(D9>=0,\"None/Low\",\"Error\")))","v":"None/Low"},{"$f":"IF(F4=\"High\", 3, IF(F4=\"Moderate\", 2, IF(F4=\"None/Low\", 1, 0)))","v":1}]
["WARMTH",2,{"$f":"Questionnaire!M218","v":"Must Complete"},{"$f":"IF(C5<>\"Must Complete\", C5, 0)","v":0}]
[null,3,{"$f":"Questionnaire!M224","v":"Must Complete"},{"$f":"IF(C6<>\"Must Complete\", C6, 0)","v":0}]
[null,4,{"$f":"Questionnaire!M230","v":"Must Complete"},0]
[null,5,{"$f":"Questionnaire!M236","v":"Must Complete"},0]
[null,null,"Total",{"$f":"SUM(D4:D8)","v":0}]
[]
["IOWA ",6,{"$f":"Questionnaire!M242","v":"Must Complete"},{"$f":"IF(C11<>\"Must Complete\", C11, 0)","v":0},null,{"$f":"IF(D15>=25,\"None/Low\",IF(D15>=20,\"Moderate\",IF(D15<=19,\"High\",\"Error\")))","v":"High"},{"$f":"IF(F11=\"High\", 3, IF(F11=\"Moderate\", 2, IF(F11=\"None/Low\", 1, 0)))","v":3}]
["HOSTILITY",7,{"$f":"Questionnaire!M248","v":"Must Complete"},{"$f":"IF(C12<>\"Must Complete\", C12, 0)","v":0}]
[null,8,{"$f":"Questionnaire!M254","v":"Must Complete"},0]
[null,9,{"$f":"Questionnaire!M260","v":"Must Complete"},0]
[null,null,"Total",{"$f":"SUM(D11:D14)","v":0}]
[]
["Inter-parental conflict"]
["DYADIC "]
["ADJUSTMENT",1,{"$f":"Questionnaire!M272","v":"Must Complete"},{"$f":"IF(C19<>\"Must Complete\", C19, 0)","v":0},null,{"$f":"IF(D26<=13,\"High\",IF(D26<=18,\"Moderate\",IF(D26>=19,\"None/Low\",\"Error\")))","v":"High"},{"$f":"IF(F19=\"High\", 3, IF(F19=\"Moderate\", 2, IF(F19=\"None/Low\", 1, 0)))","v":3}]
["SCALE",2,{"$f":"Questionnaire!M278","v":"Must Complete"},{"$f":"IF(C20<>\"Must Complete\", C20, 0)","v":0}]
[null,3,{"$f":"Questionnaire!M284","v":"Must Complete"},0]
[null,4,{"$f":"Questionnaire!M293","v":"Must Complete"},0]
[null,5,{"$f":"Questionnaire!M301","v":"Must Complete"},0]
[null,6,{"$f":"Questionnaire!M309","v":"Must Complete"},0]
[null,7,{"$f":"Questionnaire!M318","v":"Must Complete"},0]
[null,null,"Total",{"$f":"SUM(D19:D25)","v":0}]
[]
["DAS Unscored",8,{"$f":"Questionnaire!M330","v":"Must Complete"},{"$f":"IF(C28<>\"Must Complete\", Questionnaire!L330, 0)","v":0}]
["SATISFACTION",9,{"$f":"Questionnaire!M337","v":"Must Complete"},{"$f":"IF(C29<>\"Must Complete\", Questionnaire!L337, 0)","v":0}]
[null,10,{"$f":"Questionnaire!M344","v":"Must Complete"},{"$f":"IF(C30<>\"Must Complete\", Questionnaire!L344, 0)","v":0}]
[null,11,{"$f":"Questionnaire!M351","v":"Must Complete"},{"$f":"IF(C31<>\"Must Complete\", Questionnaire!L351, 0)","v":0}]
[]
["Scores"]
[null,"Iowa Warmth",{"$f":"G4","v":1}]
[null,"Iowa Hostility",{"$f":"G11","v":3}]
[null,"DAS",{"$f":"G19","v":3}]
[null,"Highest Score",{"$f":"MAX(C34:C36)","v":3},null,"Amalgamated Score",{"$f":"C37","v":3},"Level of Conflict",{"$f":"IF(F37=3, \"High Intensity Support\", IF(F37=2, \"Moderate Intensity Support\", \"Other Support / None RPCP\"))","v":"High Intensity Support"}]