{"text_format":"1","workbook":"xlsx","n_sheets":6,"sheets":["Questionnaire","Admin","Scoring","CPA","DWP","Provider"],"not_rendered":{"charts":0,"images":0,"macros":1,"external_links":0,"defined_names":3,"comments":0,"pivot_tables":0},"unopened":[],"bounds":{"document_bytes":16777216,"sheet_cells":100000,"rows_first":2000,"rows_last":500,"rows_between":2000,"halvings":0,"cell_chars":16384,"cell_head_chars":4096},"cells_cut":0,"cells_raw":0,"read":"whole","date_system":"1900"}

{"sheet":"Questionnaire","index":0,"n_rows":541,"n_cols":14,"rows_kept":541,"cut":false,"hidden":false,"merged":[[520,4,520,7],[503,3,503,8],[487,3,487,8],[489,3,489,8],[491,3,491,8],[189,3,189,6],[191,3,191,6],[497,3,497,8],[374,3,374,6],[499,3,499,8],[501,3,501,8],[493,3,493,8],[495,3,495,8],[179,1,179,7],[180,1,180,7],[181,1,181,7],[182,1,182,7],[169,1,169,7],[170,1,170,7],[176,1,176,7],[177,1,177,7],[178,1,178,7],[159,1,159,7],[165,1,165,7],[166,1,166,7],[167,1,167,7],[168,1,168,7],[154,1,154,7],[155,1,155,7],[156,1,156,7],[157,1,157,7],[158,1,158,7],[149,1,149,7],[150,1,150,7],[151,1,151,7],[152,1,152,7],[153,1,153,7],[54,3,54,8],[49,1,49,2],[50,1,50,2],[51,1,51,2],[52,1,52,2],[53,1,53,2],[54,1,54,2],[49,3,49,8],[50,3,50,8],[51,3,51,8],[52,3,52,8],[53,3,53,8],[55,3,55,8],[56,3,56,8],[57,3,57,8],[58,3,58,8],[62,1,62,6],[55,1,55,2],[56,1,56,2],[57,1,57,2],[58,1,58,2],[64,1,64,6],[65,1,65,6],[66,1,66,6],[62,7,62,8],[63,7,63,8],[64,7,64,8],[65,7,65,8],[66,7,66,8],[63,1,63,6],[81,1,81,7],[82,1,82,7],[83,1,83,7],[84,1,84,7],[85,1,85,7],[86,1,86,7],[87,1,87,7],[88,1,88,7],[89,1,89,7],[90,1,90,7],[91,1,91,7],[92,1,92,7],[93,1,93,7],[94,1,94,7],[95,1,95,7],[96,1,96,7],[97,1,97,7],[98,1,98,7],[108,1,108,7],[109,1,109,7],[110,1,110,7],[120,1,120,7],[121,1,121,7],[99,1,99,7],[100,1,100,7],[101,1,101,7],[102,1,102,7],[103,1,103,7],[104,1,104,7],[105,1,105,7],[116,1,116,7],[117,1,117,7],[536,1,537,9],[528,1,528,5],[529,1,529,5],[530,1,530,5],[531,1,531,5],[532,1,532,5],[26,1,27,9],[138,1,138,7],[139,1,139,7],[140,1,140,7],[141,1,141,7],[122,1,122,7],[123,1,123,7],[124,1,124,7],[129,1,129,7],[130,1,130,7],[131,1,131,7],[132,1,132,7],[133,1,133,7],[134,1,134,7],[118,1,118,7],[119,1,119,7],[106,1,106,7],[107,1,107,7]]}
[null,null,null,null,null,null,null,null,null,null,"v5"]
[]
[null,"Reducing Parental Conflict Programme"]
[null,"Referral Stage Questionnaire "]
[null,"For parents who are  currently in a relationship"]
[]
[]
[null,"Please read the following instructions.",null,null,null,null,null,null,null,null,null,0]
[]
[null,"Please could you answer all questions in Part 1 asking for information relating to you ",null,null,null,null,null,null,null,null,null,"Values"]
[null,"and your family."]
[null,null,null,null,null,null,null,null,null,null,null,0]
[null,"Once you have provided your information please move on to Part 2. Please answer "]
[null,"all questions in this section."]
[]
[null,"Once completed please return the questionnaire to the person who gave it to "]
[null,"you"]
[null,null,null,null,null,null,null,null,null,null,null,0]
[null,"Additional Needs (including any needs for interpreters etc.)"]
[]
[null,"I have no additional needs that might make it difficult for me to take part"]
[]
[null,"I have additional needs that might make it difficult for me to take part. "]
[null,"I have given details of these below:"]
[null,null,null,null,null,null,null,null,null,null,null,0,{"$f":"IF(L25=1, \"No Additional Needs Identified\", IF(L25=2, \"Additional Needs Identified\", \"Must Complete\"))","v":"Must Complete"}]
[null,"Please give details"]
[]
[null,null,null,null,null,null,null,null,null,null,null,{"$f":"IF(B27>0, B27, \"Additional Needs not entered\")","v":"Additional Needs not entered"},{"$f":"IF(B27>0, \"Additional Needs Entered\", \"Additional Needs not entered\")","v":"Additional Needs not entered"}]
[]
[null,"I have completed a separate Participation Agreement with the person who gave me the "]
[null,"questionnaire",null,null,null,null,null,null,null,null,null,false,{"$f":"IF(L31=TRUE, \"Participation Agreement Completed\", \"Must Complete\")","v":"Must Complete"}]
[]
[null,"If you are completing a paper copy of this questionnaire, please select just one answer "]
[null,"for multiple choice questions."]
[]
[null,"Is anyone within your household currently in work?"]
[null,"Yes"]
[null,"No",null,null,null,null,null,null,null,null,null,0,{"$f":"IF(L38=1, \"Yes\", IF(L38=2, \"No\", \"Must Complete\"))","v":"Must Complete"}]
[]
[]
[null,"PART 1"]
[]
[null,"Parent information"]
[]
[null,"This section collects important information about you and your family."]
[null,"Please complete all questions in this section."]
[]
[null,"About You"]
[]
[null,null,null,"Please complete below"]
[null,"Title",null,null,null,null,null,null,null,null,null,null,{"$f":"IF(D51>0, D51, \"Must Complete\")","v":"Must Complete"}]
[null,"Forenames",null,null,null,null,null,null,null,null,null,null,"Must Complete"]
[null,"Surname",null,null,null,null,null,null,null,null,null,null,"Must Complete"]
[null,"Date of birth\n(dd/mm/yyyy)",null,null,null,null,null,null,null,null,null,null,"Must Complete"]
[null,"Telephone\nnumber (mobile)",null,null,null,null,null,null,null,null,null,null,{"$f":"IF(D55>0, \"+44 \"& D55, \"Must Complete\")","v":"Must Complete"}]
[null,"Alternative\ntelephone \nnumber (e.g. landline)",null,null,null,null,null,null,null,null,null,null,{"$f":"IF(D56>0, \"+44 \"&D56, \"No alternative number supplied\")","v":"No alternative number supplied"}]
[null,"Address",null,null,null,null,null,null,null,null,null,null,"Must Complete"]
[null,"Post code",null,null,null,null,null,null,null,null,null,null,"Must Complete"]
[null,"Email",null,null,null,null,null,null,null,null,null,null,{"$f":"IF(D59>0, D59, \"No email address supplied\")","v":"No email address supplied"}]
[]
[null,"What is your gender identity? Please select below."]
[]
[]
[null,"Male"]
[null,"Female"]
[null,"Other"]
[null,"Prefer not to say",null,null,null,null,null,null,null,null,null,0,{"$f":"IF(L67=0,\"Must Complete\",IF(L67=1,\"Prefer not to say\",IF(L67=2,\"Other\",IF(L67=3,\"Female\",IF(L67=4,\"Male\",\"INCORRECT\")))))","v":"Must Complete"}]
[]
[null,"Disability:"]
[null,"Do you have a long-standing physical or mental impairment, illness or disability? By "]
[null,"long-standing' we mean anything that has troubled you over a period of at least 12 "]
[null,"months or that is likely to trouble you over a period of at least 12 months."]
[]
[]
[null,"Yes",null,"No ",null,"Prefer not to say",null,null,null,null,null,0,{"$f":"IF(L75=0, \"Must Complete\", IF(L75=1, \"Prefer not to say\", IF(L75=2, \"No\", IF(L75=3, \"Yes\",\"Incorrect\"))))","v":"Must Complete"}]
[]
[]
[]
[null,"What is your ethnic group? Select one option that best describes your ethnic group "]
[null,"or background."]
[]
[null,"White"]
[null,"    1.  English/Welsh/Scottish/Northern Irish/British"]
[null,"    2.  Irish"]
[null,"    3.  Gypsy or Irish Traveller"]
[null,"    4.  Any other white background. Please describe below:"]
[]
[null,"Mixed/ Multiple Ethnic Groups"]
[null,"    5.  White and Black Caribbean"]
[null,"    6.  White and Black African"]
[null,"    7.  White and Asian"]
[null,"    8.  Any other Mixed/Multiple ethnic background. Please \n         describe below:"]
[]
[null,"Asian/Asian British"]
[null,"    9.  Indian"]
[null,"    10. Pakistani"]
[null,"    11. Bangladeshi"]
[null,"    12. Chinese"]
[null,"    13. Any other Asian background. Please describe below:"]
[]
[null,"Black/African/Caribbean/Black British "]
[null,"    14. African"]
[null,"    15.  Caribbean"]
[null,"    16. Any other Black/African/Caribbean background. Please describe below:"]
[]
[null,"Other ethnic group "]
[null,"    17. Arab"]
[null,"    18. Any other ethnic group. Please describe below:"]
[null,null,null,null,null,null,null,null,null,null,null,0]
[null,"    19. Prefer not to say",null,null,null,null,null,null,null,null,null,{"$f":"IF(L109=4, B87, IF(L109=8, B93, IF(L109=13,B100,  IF(L109=16, B105, IF(L109=18, B109, \"None Selected\")))))","v":"None Selected"}]
[null,null,null,null,null,null,null,null,null,null,null,null,{"$f":"IF(L109>0,L109,\"Must Complete\")","v":"Must Complete"},{"$f":"IF(L109=0, \"None Selected\", IF(L110=\"None Selected\", \"Standard Ethnicity Type\",  IF(L110=0, \"Please Select/Enter Type\",L110)))","v":"None Selected"}]
[]
[null,"Please answer the following questions by selecting your answer."]
[]
[null,"What is your current marital status?"]
[]
[null,"Single (never married or been in a civil partnership)"]
[null,"Married or in a Civil Partnership and living with husband/wife"]
[null,"Living together"]
[null,"Steady relationship without living together "]
{"$rows_left_out":422}
{"sheet":"Admin","index":1,"n_rows":18,"n_cols":10,"rows_kept":18,"cut":false,"hidden":false,"merged":[]}
[]
["***** FOR ADMINISTRATION USE ONLY ******"]
[]
["CPA Email"," rpcgateway@gateshead.gov.uk"]
[]
["DWP Email","RPC.REFERRALTEAM@DWP.GOV.UK"]
[]
["Provider Email","RPC@relate.org.uk"]
[]
[]
[]
[]
[]
[null,"Level Calculated"]
[null,{"$f":"IF(Questionnaire!L31,Scoring!H49, \"Participation Statement not Completed DO NOT FORWARD\")","v":"Participation Statement not Completed DO NOT FORWARD"}]
[]
[null,{"$f":"\"RSQ -  \"&B15","v":"RSQ -  Participation Statement not Completed DO NOT FORWARD"}]
[null,{"$f":"CPA!I9","v":"TEST"},null,null,null,null,null,null,null,{"$f":"CPA!I9","v":"TEST"}]

{"sheet":"Scoring","index":2,"n_rows":49,"n_cols":8,"rows_kept":49,"cut":false,"hidden":true,"merged":[]}
["Scoring "]
[]
["Interaction",null,"From Questionnaire","Numeric Value",null,"Conflict Level"]
["IOWA",1,{"$f":"Questionnaire!M218","v":"Must Complete"},{"$f":"IF(C4<>\"Must Complete\", C4, 0)","v":0},null,{"$f":"IF(D9>=33,\"High\",IF(D9>=25,\"Moderate\",IF(D9>=0,\"None/Low\",\"Error\")))","v":"None/Low"},{"$f":"IF(F4=\"High\", 3, IF(F4=\"Moderate\", 2, IF(F4=\"None/Low\", 1, 0)))","v":1}]
["WARMTH",2,{"$f":"Questionnaire!M224","v":"Must Complete"},{"$f":"IF(C5<>\"Must Complete\", C5, 0)","v":0}]
[null,3,{"$f":"Questionnaire!M230","v":"Must Complete"},0]
[null,4,{"$f":"Questionnaire!M236","v":"Must Complete"},0]
[null,5,{"$f":"Questionnaire!M242","v":"Must Complete"},0]
[null,null,"Total",{"$f":"SUM(D4:D8)","v":0}]
[]
["IOWA ",6,{"$f":"Questionnaire!M248","v":"Must Complete"},{"$f":"IF(C11<>\"Must Complete\", C11, 0)","v":0},null,{"$f":"IF(D15>=25,\"None/Low\",IF(D15>=20,\"Moderate\",IF(D15>=0,\"High\",\"Error\")))","v":"High"},{"$f":"IF(F11=\"High\", 3, IF(F11=\"Moderate\", 2, IF(F11=\"None/Low\", 1, 0)))","v":3}]
["HOSTILITY",7,{"$f":"Questionnaire!M254","v":"Must Complete"},{"$f":"IF(C12<>\"Must Complete\", C12, 0)","v":0}]
[null,8,{"$f":"Questionnaire!M260","v":"Must Complete"},0]
[null,9,{"$f":"Questionnaire!M266","v":"Must Complete"},0]
[null,null,"Total",{"$f":"SUM(D11:D14)","v":0}]
[]
["Inter-parental conflict"]
["DYADIC "]
["ADJUSTMENT",1,{"$f":"Questionnaire!M278","v":"Must Complete"},{"$f":"IF(C19<>\"Must Complete\", C19, 0)","v":0},null,{"$f":"IF(D26<=13,\"High\",IF(D26<=18,\"Moderate\",IF(D26>=19,\"None/Low\",\"Error\")))","v":"High"},{"$f":"IF(F19=\"High\", 3, IF(F19=\"Moderate\", 2, IF(F19=\"None/Low\", 1, 0)))","v":3}]
["SCALE",2,{"$f":"Questionnaire!M284","v":"Must Complete"},{"$f":"IF(C20<>\"Must Complete\", C20, 0)","v":0}]
[null,3,{"$f":"Questionnaire!M290","v":"Must Complete"},0]
[null,4,{"$f":"Questionnaire!M299","v":"Must Complete"},0]
[null,5,{"$f":"Questionnaire!M307","v":"Must Complete"},0]
[null,6,{"$f":"Questionnaire!M315","v":"Must Complete"},0]
[null,7,{"$f":"Questionnaire!M324","v":"Must Complete"},0]
[null,null,"Total",{"$f":"SUM(D19:D25)","v":0}]
[]
["DAS Unscored",8,{"$f":"Questionnaire!M336","v":"Must Complete"},{"$f":"IF(C28<>\"Must Complete\", Questionnaire!L336, 0)","v":0}]
["SATISFACTION",9,{"$f":"Questionnaire!M343","v":"Must Complete"},{"$f":"IF(C29<>\"Must Complete\", Questionnaire!L343, 0)","v":0}]
[null,10,{"$f":"Questionnaire!M350","v":"Must Complete"},{"$f":"IF(C30<>\"Must Complete\", Questionnaire!L350, 0)","v":0}]
[null,11,{"$f":"Questionnaire!$M$357","v":"Must Complete"},{"$f":"IF(C31<>\"Must Complete\", Questionnaire!L357, 0)","v":0}]
[]
[]
["O'Leary Porter"]
[null,1,{"$f":"Questionnaire!$L$382","v":0},{"$f":"IF(C35<>\"INCOMPLETE\", C35, 0)","v":0}]
[null,2,{"$f":"Questionnaire!$L$390","v":0},0]
[null,3,{"$f":"Questionnaire!$L$398","v":0},0]
[null,4,{"$f":"Questionnaire!$L$406","v":0},0]
[null,5,{"$f":"Questionnaire!$L$414","v":0},0]
[null,6,{"$f":"Questionnaire!$L$421","v":0},0]
[null,7,{"$f":"Questionnaire!$L$428","v":0},0]
[null,8,{"$f":"Questionnaire!$L$435","v":0},0,null,{"$f":"IF(D43>=32,\"High\",IF(D43>=26,\"Moderate\",IF(D43<=25,\"None/Low\",\"Error\")))","v":"None/Low"},{"$f":"IF(F42=\"High\", 3, IF(F42=\"Moderate\", 2, IF(F42=\"None/Low\", 1, 0)))","v":1}]
[null,null,"Total",{"$f":"SUM(D35:D42)","v":0}]
["Scores"]
[null,"Iowa Warmth",{"$f":"G4","v":1}]
[null,"Iowa Hostility",{"$f":"G11","v":3}]
[null,"DAS",{"$f":"G19","v":3}]
[null,"O'Leary",{"$f":"G42","v":1}]
[null,"Highest Score",{"$f":"MAX(C45:C48)","v":3},null,"Amalgamated Score",{"$f":"C49","v":3},"Level of Conflict",{"$f":"IF(F49=3, \"High Intensity Support\", IF(F49=2, \"Moderate Intensity Support\", \"Other Support / None RPCP\"))","v":"High Intensity Support"}]

{"sheet":"CPA","index":3,"n_rows":13,"n_cols":15,"rows_kept":13,"cut":false,"hidden":true,"merged":[]}
[]
[" Tab for CPA Admin Use Only"]
[]
[]
["RSQ Completed","Parent Name","Date of Birth","Phone Number","Practitioner","Role","Team","Service","Organisation","Email","Phone","LA","Workless Household","Support Level","Main Carer"]
[{"$f":"Questionnaire!M502","v":"Must Complete"},{"$f":"Questionnaire!M51&\" \"&Questionnaire!M52&\" \"&Questionnaire!M53","v":"Must Complete Must Complete Must Complete"},{"$f":"Questionnaire!M54","v":"Must Complete"},{"$f":"Questionnaire!M55","v":"Must Complete"},{"$f":"Questionnaire!M488","v":"Must Complete"},{"$f":"Questionnaire!M490","v":"Must Complete"},{"$f":"Questionnaire!M492","v":"Must Complete"},{"$f":"Questionnaire!M494","v":"Must Complete"},{"$f":"Questionnaire!M496","v":"Must Complete"},{"$f":"Questionnaire!M498","v":"Must Complete"},{"$f":"Questionnaire!M500","v":"Must Complete"},{"$f":"Questionnaire!M504","v":"Must Complete"},{"$f":"IF(Questionnaire!M38=\"Yes\", \"No\", IF(Questionnaire!M38=\"No\", \"Yes\", \"Not Completed\"))","v":"Not Completed"},{"$f":"Admin!B15","v":"Participation Statement not Completed DO NOT FORWARD"},"N/A"]
[null,null,null,null,null,null,null,null,"Enter UIN Below"]
[null,"Linked Co-Parent"]
[null,{"$f":"Questionnaire!M190","v":"Co-Parent details not supplied"},{"$f":"Questionnaire!M192","v":"Co-parent details not supplied"},null,null,null,null,null,"TEST","*Copy and paste yellow cell data to UIN spreadsheet "]
[null,null,null,null,null,null,null,null,null,"to assign a UIN"]
[null,"Child",null,null," Use this button  to send the full RSQ to DWP"]
[null,{"$f":"Questionnaire!M375","v":"Must Complete"},null,null,null,null,null,null,"test2"]
[null,null,null,null," Use this button to send RSQ data to the Provider"]

{"sheet":"DWP","index":4,"n_rows":259,"n_cols":10,"rows_kept":259,"cut":false,"hidden":true,"merged":[[232,3,232,8],[234,3,234,8],[230,3,230,8],[75,3,75,6],[77,3,77,6],[184,3,184,6],[226,3,226,8],[228,3,228,8],[44,1,44,2],[44,3,44,8],[48,1,48,6],[48,7,48,8],[41,1,41,2],[41,3,41,8],[42,1,42,2],[42,3,42,8],[43,1,43,2],[43,3,43,8],[37,1,37,2],[37,3,37,8],[39,1,39,2],[39,3,39,8],[40,1,40,2],[40,3,40,8],[38,1,38,2],[38,3,38,8],[36,1,36,2],[36,3,36,8],[34,1,34,2],[34,3,34,8],[35,1,35,2],[35,3,35,8],[236,3,236,8],[238,3,238,8],[240,3,240,8],[242,3,242,8],[250,2,250,5],[254,1,254,5],[255,1,255,5],[256,1,256,5],[257,1,257,5],[258,1,258,5]]}
[null,"Level of Support Required = ",null,null,{"$f":"Admin!B15","v":"Participation Statement not Completed DO NOT FORWARD"}]
[null,"Workless Household",null,{"$f":"CPA!M6","v":"Not Completed"}]
[]
[null,"Reducing Parental Conflict Programme"]
[null,"Referral Stage Questionnaire "]
[null,"For parents who are  currently in a relationship together"]
[]
[]
[null,"Please read the following instructions."]
[]
[null,"Please could you answer all questions in Part 1 asking for information relating to you "]
[null,"and your family."]
[]
[null,"Once you have provided your information please move on to Part 2. Please answer "]
[null,"all questions in this section."]
[]
[null,"Once completed please return the questionnaire to the person who gave it to "]
[null,"you"]
[]
[null,"Additional Needs - "]
[null,{"$f":"Questionnaire!M25","v":"Must Complete"}]
[]
[null,"Participation Agreement"]
[null,{"$f":"Questionnaire!M31","v":"Must Complete"}]
[]
[null,"PART 1"]
[]
[null,"Parent information"]
[]
[null,"This section collects important information about you and your family."]
[null,"Please complete all questions in this section."]
[]
[null,"About You"]
[]
[null,null,null,"Please complete below"]
[null,"Title",null,{"$f":"Questionnaire!M51","v":"Must Complete"}]
[null,"Forenames",null,{"$f":"Questionnaire!M52","v":"Must Complete"}]
[null,"Surname",null,{"$f":"Questionnaire!M53","v":"Must Complete"}]
[null,"UIN",null,{"$f":"CPA!I9","v":"TEST"}]
[null,"Date of birth\n(dd/mm/yyyy)",null,{"$f":"Questionnaire!M54","v":"Must Complete"}]
[null,"Telephone\nnumber (mobile)",null,{"$f":"Questionnaire!M55","v":"Must Complete"}]
[null,"Alternative\ntelephone \nnumber (e.g. landline)",null,{"$f":"Questionnaire!M56","v":"No alternative number supplied"}]
[null,"Address",null,{"$f":"Questionnaire!M57","v":"Must Complete"}]
[null,"Post code",null,{"$f":"Questionnaire!M58","v":"Must Complete"}]
[null,"Email",null,{"$f":"Questionnaire!M59","v":"No email address supplied"}]
[]
[null,"What is your gender identity? Please select below."]
[null,{"$f":"Questionnaire!M75","v":"Must Complete"}]
[]
[null,"Disability:"]
[null,{"$f":"Questionnaire!M75","v":"Must Complete"}]
[]
[null,"What is your ethnic group? "]
[null,{"$f":"Questionnaire!M111","v":"Must Complete"}]
[null,{"$f":"Questionnaire!L110","v":"None Selected"}]
[]
[null,"What is your marital status?"]
[null,{"$f":"Questionnaire!M125","v":"Must Complete"}]
[]
[null,"How many children do you have primary or shared care responsibility for?"]
[null,{"$f":"Questionnaire!M135","v":"Must Complete"}]
[]
[null,"Are you or your partner pregnant now?"]
[null,{"$f":"Questionnaire!M142","v":"Must Complete"}]
[]
[null,"Which of these best describes your current employment status?"]
[null,{"$f":"Questionnaire!M160","v":"Must Complete"}]
[]
[null,"Are you presently or have you ever experienced mental health problems? "]
[null,{"$f":"Questionnaire!M171","v":"Must Complete"}]
[]
[null,"What is your relationship with the person you are currently experiencing"]
[null,"conflict with? "]
[null,{"$f":"Questionnaire!M183","v":"Must Complete"}]
[]
[null,"Their name",null,{"$f":"Questionnaire!M190","v":"Co-Parent details not supplied"}]
[]
[null,"Their UIN",null,{"$f":"CPA!I12","v":"test2"}]
[]
[]
[null,"PART 2 - About Your Circumstances"]
[]
[]
[null,"There are three sections of questions in this part of the questionnaire. Please answer "]
[null,"all questions to the best of your ability, even if they do not seem entirely relevant to "]
[null,"you. "]
[]
[null,"Once you have finished these questions, please return the questionnaire to the "]
[null,"person who gave it to you. "]
[]
[null,"Section 1:  You and your spouse/partner"]
[]
[null,"Please think about the times during the last 4 weeks when you and your spouse/partner"]
[null,"have spent time talking or doing things together."]
[]
[null,"With those times in mind, please indicate how often your spouse/partner acted in the "]
[null,"following ways towards you. During the past 4 weeks, how often did your "]
[null,"spouse/partner…",null,"Score from 1 (Always) to 7 (Never)"]
[]
[null,"1. Let you know they really care about you"]
[null,{"$f":"Questionnaire!M218","v":"Must Complete"}]
[]
[null,"2. Was loving and / or affectionate towards you"]
[null,{"$f":"Questionnaire!M224","v":"Must Complete"}]
[]
[null,"3. Let you know that they appreciate your ideas or the things you do"]
[null,{"$f":"Questionnaire!M230","v":"Must Complete"}]
[]
[null,"4. Help you to do something that is important to you"]
[null,{"$f":"Questionnaire!M236","v":"Must Complete"}]
[]
[null,"5. Be supportive and understanding towards you"]
[null,{"$f":"Questionnaire!M242","v":"Must Complete"}]
[]
[null,"6. Criticise you"]
[null,{"$f":"Questionnaire!M248","v":"Must Complete"}]
[]
[null,"7. Argue with you when you disagreed about something"]
[null,{"$f":"Questionnaire!M254","v":"Must Complete"}]
[]
{"$rows_left_out":140}
{"sheet":"Provider","index":5,"n_rows":229,"n_cols":8,"rows_kept":229,"cut":false,"hidden":true,"merged":[[46,3,46,8],[65,3,65,6],[22,1,23,9],[37,1,37,2],[37,3,37,8],[38,1,38,2],[38,3,38,8],[43,1,43,2],[43,3,43,8],[44,1,44,2],[44,3,44,8],[41,3,41,8],[41,1,41,2],[67,3,67,6],[176,3,176,6],[39,1,39,2],[39,3,39,8],[228,1,229,9],[222,3,222,8],[224,3,224,8],[40,1,40,2],[40,3,40,8],[42,1,42,2],[42,3,42,8],[45,1,45,2],[45,3,45,8],[218,3,218,8],[220,3,220,8],[46,1,46,2]]}
[null,"Level of Support Required = ",null,null,{"$f":"Admin!B15","v":"Participation Statement not Completed DO NOT FORWARD"}]
[null,"Workless Household",null,{"$f":"CPA!M6","v":"Not Completed"}]
[]
[null,"Reducing Parental Conflict Programme"]
[null,"Referral Stage Questionnaire "]
[null,"For parents who are  currently in a relationship together"]
[]
[null,"Please read the following instructions."]
[]
[null,"Please could you answer all questions in Part 1 asking for information relating to you "]
[null,"and your family."]
[]
[null,"Once you have provided your information please move on to Part 2. Please answer "]
[null,"all questions in this section."]
[]
[null,"Once completed please return the questionnaire to the person who gave it to "]
[null,"you"]
[]
[null,"Additional Needs - "]
[null,{"$f":"Questionnaire!M25","v":"Must Complete"}]
[]
[null,"Details"]
[null,{"$f":"Questionnaire!L28","v":"Additional Needs not entered"}]
[]
[]
[null,"Participation Agreement"]
[null,{"$f":"Questionnaire!M31","v":"Must Complete"}]
[]
[null,"PART 1"]
[]
[null,"Parent information"]
[]
[null,"This section collects important information about you and your family."]
[null,"Please complete all questions in this section."]
[]
[null,"About You"]
[]
[null,null,null,"Please complete below"]
[null,"Title",null,{"$f":"Questionnaire!M51","v":"Must Complete"}]
[null,"Forenames",null,{"$f":"Questionnaire!M52","v":"Must Complete"}]
[null,"Surname",null,{"$f":"Questionnaire!M53","v":"Must Complete"}]
[null,"UIN",null,{"$f":"CPA!I9","v":"TEST"}]
[null,"Telephone\nnumber (mobile)",null,{"$f":"Questionnaire!M55","v":"Must Complete"}]
[null,"Alternative\ntelephone \nnumber (e.g. landline)",null,{"$f":"Questionnaire!M56","v":"No alternative number supplied"}]
[null,"Address",null,{"$f":"Questionnaire!M57","v":"Must Complete"}]
[null,"Post code",null,{"$f":"Questionnaire!M58","v":"Must Complete"}]
[null,"Email",null,{"$f":"Questionnaire!M59","v":"No email address supplied"}]
[]
[]
[null,"How many children do you have primary or shared care responsibility for?"]
[null,{"$f":"Questionnaire!M135","v":"Must Complete"}]
[]
[null,"Are you or your partner pregnant now?"]
[null,{"$f":"Questionnaire!M142","v":"Must Complete"}]
[]
[null,"Which of these best describes your current employment status?"]
[null,{"$f":"Questionnaire!M160","v":"Must Complete"}]
[]
[null,"Are you presently or have you ever experienced mental health problems? "]
[null,{"$f":"Questionnaire!M171","v":"Must Complete"}]
[]
[null,"What is your relationship with the person you are currently experiencing"]
[null,"conflict with? "]
[null,{"$f":"Questionnaire!M183","v":"Must Complete"}]
[]
[null,"Their name",null,{"$f":"Questionnaire!M190","v":"Co-Parent details not supplied"}]
[]
[null,"Their UIN",null,{"$f":"CPA!I12","v":"test2"}]
[]
[]
[null,"Name of the child they are most concerned about",null,null,null,null,null,{"$f":"Questionnaire!$M$375","v":"Must Complete"}]
[]
[]
[null,"PART 2 - About Your Circumstances"]
[]
[null,"There are three sections of questions in this part of the questionnaire. Please answer "]
[null,"all questions to the best of your ability, even if they do not seem entirely relevant to "]
[null,"you. "]
[]
[null,"Once you have finished these questions, please return the questionnaire to the "]
[null,"person who gave it to you. "]
[]
[null,"Section 1:  You and your spouse/partner"]
[]
[null,"Please think about the times during the last 4 weeks when you and your spouse/partner"]
[null,"have spent time talking or doing things together."]
[]
[null,"With those times in mind, please indicate how often your spouse/partner acted in the "]
[null,"following ways towards you. During the past 4 weeks, how often did your "]
[null,"spouse/partner…",null,"Score from 1 (Always) to 7 (Never)"]
[]
[null,"1. Let you know they really care about you"]
[null,{"$f":"Questionnaire!M218","v":"Must Complete"}]
[]
[null,"2. Was loving and / or affectionate towards you"]
[null,{"$f":"Questionnaire!M224","v":"Must Complete"}]
[]
[null,"3. Let you know that they appreciate your ideas or the things you do"]
[null,{"$f":"Questionnaire!M230","v":"Must Complete"}]
[]
[null,"4. Help you to do something that is important to you"]
[null,{"$f":"Questionnaire!M236","v":"Must Complete"}]
[]
[null,"5. Be supportive and understanding towards you"]
[null,{"$f":"Questionnaire!M242","v":"Must Complete"}]
[]
[null,"6. Criticise you"]
[null,{"$f":"Questionnaire!M248","v":"Must Complete"}]
[]
[null,"7. Argue with you when you disagreed about something"]
[null,{"$f":"Questionnaire!M254","v":"Must Complete"}]
[]
[null,"8. Get angry at you"]
[null,{"$f":"Questionnaire!M260","v":"Must Complete"}]
[]
[null,"9. Shout at you because they were upset with you"]
[null,{"$f":"Questionnaire!M266","v":"Must Complete"}]
[]
[null,"Section 2:  Agreement in relationships"]
[]
{"$rows_left_out":109}