{"text_format":"1","workbook":"xlsx","n_sheets":6,"sheets":["Questionnaire","Admin","CPA","DWP","Provider","Scoring"],"not_rendered":{"charts":0,"images":0,"macros":1,"external_links":0,"defined_names":3,"comments":0,"pivot_tables":0},"unopened":[],"bounds":{"document_bytes":16777216,"sheet_cells":100000,"rows_first":2000,"rows_last":500,"rows_between":2000,"halvings":0,"cell_chars":16384,"cell_head_chars":4096},"cells_cut":0,"cells_raw":0,"read":"whole","date_system":"1900"}

{"sheet":"Questionnaire","index":0,"n_rows":488,"n_cols":14,"rows_kept":488,"cut":false,"hidden":false,"merged":[[485,1,486,9],[477,1,477,5],[478,1,478,5],[479,1,479,5],[480,1,480,5],[481,1,481,5],[26,1,27,9],[126,1,126,7],[127,1,127,7],[128,1,128,7],[132,1,132,7],[133,1,133,7],[134,1,134,7],[135,1,135,7],[136,1,136,7],[137,1,137,7],[122,1,122,7],[123,1,123,7],[109,1,109,7],[110,1,110,7],[469,4,469,7],[111,1,111,7],[112,1,112,7],[113,1,113,7],[124,1,124,7],[125,1,125,7],[102,1,102,7],[103,1,103,7],[104,1,104,7],[105,1,105,7],[106,1,106,7],[107,1,107,7],[108,1,108,7],[120,1,120,7],[121,1,121,7],[93,1,93,7],[94,1,94,7],[95,1,95,7],[96,1,96,7],[97,1,97,7],[98,1,98,7],[99,1,99,7],[100,1,100,7],[101,1,101,7],[84,1,84,7],[85,1,85,7],[86,1,86,7],[87,1,87,7],[88,1,88,7],[89,1,89,7],[90,1,90,7],[91,1,91,7],[92,1,92,7],[60,1,60,2],[61,1,61,2],[67,1,67,6],[68,1,68,6],[69,1,69,6],[65,7,65,8],[66,7,66,8],[67,7,67,8],[68,7,68,8],[69,7,69,8],[66,1,66,6],[144,1,144,7],[145,1,145,7],[146,1,146,7],[147,1,147,7],[148,1,148,7],[57,3,57,8],[52,1,52,2],[53,1,53,2],[54,1,54,2],[55,1,55,2],[56,1,56,2],[57,1,57,2],[52,3,52,8],[53,3,53,8],[54,3,54,8],[55,3,55,8],[56,3,56,8],[58,3,58,8],[59,3,59,8],[60,3,60,8],[61,3,61,8],[65,1,65,6],[58,1,58,2],[59,1,59,2],[154,1,154,7],[160,1,160,7],[161,1,161,7],[162,1,162,7],[163,1,163,7],[149,1,149,7],[150,1,150,7],[151,1,151,7],[152,1,152,7],[153,1,153,7],[174,1,174,7],[175,1,175,7],[176,1,176,7],[177,1,177,7],[164,1,164,7],[165,1,165,7],[171,1,171,7],[172,1,172,7],[173,1,173,7],[436,3,436,8],[438,3,438,8],[440,3,440,8],[184,3,184,6],[186,3,186,6],[446,3,446,8],[448,3,448,8],[450,3,450,8],[452,3,452,8],[442,3,442,8],[444,3,444,8]]}
[null,null,null,null,null,null,null,null,null,null,"v5"]
[]
[null,"Reducing Parental Conflict Programme"]
[null,"Referral Stage Questionnaire "]
[null,"For parents expecting their first child who are  no longer in a relationship "]
[null,"together/separated"]
[]
[null,"Please read the following instructions."]
[]
[null,"Please could you answer all questions in Part 1 asking for information relating to you ",null,null,null,null,null,null,null,null,null,"Values"]
[null,"and your family."]
[]
[null,"Once you have provided your information please move on to Part 2. Please answer "]
[null,"all questions in this section."]
[]
[null,"Once completed please return the questionnaire to the person who gave it to "]
[null,"you."]
[]
[null,"Additional Needs (including any needs for interpreters etc.)"]
[]
[null,"I have no additional needs that might make it difficult for me to take part"]
[]
[null,"I have additional needs that might make it difficult for me to take part. "]
[null,"I have given details of these below:"]
[null,null,null,null,null,null,null,null,null,null,null,0,{"$f":"IF(L25=1, \"No Additional Needs Identified\", IF(L25=2, \"Additional Needs Identified\", \"Must Complete\"))","v":"Must Complete"}]
[null,"Please give details"]
[]
[null,null,null,null,null,null,null,null,null,null,null,{"$f":"IF(B27>0, B27, \"Additional Needs not entered\")","v":"Additional Needs not entered"},{"$f":"IF(B27>0, \"Additional Needs Entered\", \"Additional Needs not entered\")","v":"Additional Needs not entered"}]
[]
[null,"I have completed a separate Participation Agreement with the person who gave me the "]
[null,"questionnaire",null,null,null,null,null,null,null,null,null,false,{"$f":"IF(L31=TRUE, \"Participation Agreement Completed\", \"Must Complete\")","v":"Must Complete"}]
[]
[null,"If you are completing a paper copy of this questionnaire, please select just one answer "]
[null,"for multiple choice questions."]
[]
[null,"Is anyone within your household currently in work?"]
[null,"Yes"]
[null,"No",null,null,null,null,null,null,null,null,null,0,{"$f":"IF(L38=1, \"Yes\", IF(L38=2, \"No\", \"Must Complete\"))","v":"Must Complete"}]
[]
[]
[]
[]
[]
[null,"PART 1"]
[]
[null,"Parent information"]
[]
[null,"This section collects important information about you and your family."]
[null,"Please complete all questions in this section."]
[]
[null,"About You"]
[]
[null,null,null,"Please complete below"]
[null,"Title",null,null,null,null,null,null,null,null,null,null,{"$f":"IF(D54>0, D54,\"Must Complete\")","v":"Must Complete"}]
[null,"Forenames",null,null,null,null,null,null,null,null,null,null,"Must Complete"]
[null,"Surname",null,null,null,null,null,null,null,null,null,null,"Must Complete"]
[null,"Date of birth\n(dd/mm/yyyy)",null,null,null,null,null,null,null,null,null,null,"Must Complete"]
[null,"Telephone\nnumber (mobile)",null,null,null,null,null,null,null,null,null,null,{"$f":"IF(D58>0, \"+44 \"&D58,\"Must Complete\")","v":"Must Complete"}]
[null,"Alternative\ntelephone \nnumber (e.g. landline)",null,null,null,null,null,null,null,null,null,null,{"$f":"IF(D59>0,\"+44 \"& D59,\"No alternative number supplied\")","v":"No alternative number supplied"}]
[null,"Address",null,null,null,null,null,null,null,null,null,null,"Must Complete"]
[null,"Post code",null,null,null,null,null,null,null,null,null,null,"Must Complete"]
[null,"Email",null,null,null,null,null,null,null,null,null,null,{"$f":"IF(D62>0, D62, \"No email address supplied\")","v":"No email address supplied"}]
[]
[null,"What is your gender identity? Please select below."]
[]
[]
[null,"Male"]
[null,"Female"]
[null,"Other"]
[null,"Prefer not to say",null,null,null,null,null,null,null,null,null,0,{"$f":"IF(L70=0,\"Must Complete\",IF(L70=1,\"Prefer not to say\",IF(L70=2,\"Other\",IF(L70=3,\"Female\",IF(L70=4,\"Male\",\"INCORRECT\")))))","v":"Must Complete"}]
[]
[null,"Disability:"]
[null,"Do you have a long-standing physical or mental impairment, illness or disability? By "]
[null,"long-standing' we mean anything that has troubled you over a period of at least 12 "]
[null,"months or that is likely to trouble you over a period of at least 12 months."]
[]
[]
[null,"Yes",null,"No ",null,"Prefer not to say",null,null,null,null,null,0,{"$f":"IF(L78=0, \"Must Complete\", IF(L78=1, \"Prefer not to say\", IF(L78=2, \"No\", IF(L78=3, \"Yes\",\"Incorrect\"))))","v":"Must Complete"}]
[]
[]
{"$rows_left_out":409}
{"sheet":"Admin","index":1,"n_rows":18,"n_cols":10,"rows_kept":18,"cut":false,"hidden":false,"merged":[]}
[]
["***** FOR ADMINISTRATION USE ONLY ******"]
[]
["CPA Email","rpcgateway@gateshead.gov.uk"]
[]
["DWP Email","RPC.REFERRALTEAM@DWP.GOV.UK"]
[]
["Provider Email","RPC@relate.org.uk"]
[]
[]
[]
[]
[]
[null,"Level Calculated"]
[null,{"$f":"IF(Questionnaire!L31=TRUE, Scoring!H41, \"Participation Statement not Completed DO NOT FORWARD\")","v":"Participation Statement not Completed DO NOT FORWARD"}]
[]
[]
[null,{"$f":"CPA!I10","v":"TEST"},null,null,null,null,null,null,null,{"$f":"CPA!I10","v":"TEST"}]

{"sheet":"CPA","index":2,"n_rows":13,"n_cols":15,"rows_kept":13,"cut":false,"hidden":true,"merged":[]}
[]
[" Tab for CPA Admin Use Only"]
[]
[]
["Date RSQ Completed","Parent Name","Date of Birth","Phone Number","Practitioner","Role","Team","Service","Organisation","Email","Phone","LA","Workless Household","Support Level","Main Carer"]
[{"$f":"Questionnaire!M451","v":"Must Complete"},{"$f":"Questionnaire!M54&\" \"&Questionnaire!M55&\" \"&Questionnaire!M56","v":"Must Complete Must Complete Must Complete"},{"$f":"Questionnaire!M57","v":"Must Complete"},{"$f":"Questionnaire!M58","v":"Must Complete"},{"$f":"Questionnaire!M437","v":"Must Complete"},{"$f":"Questionnaire!M439","v":"Must Complete"},{"$f":"Questionnaire!M441","v":"Must Complete"},{"$f":"Questionnaire!M443","v":"Must Complete"},{"$f":"Questionnaire!M445","v":"Must Complete"},{"$f":"Questionnaire!M447","v":"Must Complete"},{"$f":"Questionnaire!M449","v":"Must Complete"},{"$f":"Questionnaire!M453","v":"Must Complete"},{"$f":"IF(Questionnaire!M38=\"Yes\", \"No\", IF(Questionnaire!M38=\"No\", \"Yes\", \"Not Completed\"))","v":"Not Completed"},{"$f":"Admin!B15","v":"Participation Statement not Completed DO NOT FORWARD"},"N/A"]
[]
[null,"Linked Co-Parent",null,null,null,null,null,null,"Enter UIN Below"]
[null,{"$f":"Questionnaire!M185","v":"Co-Parent details not supplied"},{"$f":"Questionnaire!M187","v":"Co-Parent details not supplied"}]
[null,null,null,null,null,null,null,null,"TEST",null,"*Copy and paste yellow cell data to UIN spreadsheet "]
[null,null,null,null," Use this button  to send the full RSQ to DWP",null,null,null,null,null,"to assign a UIN"]
[]
[null,null,null,null," Use this button to send RSQ data to the Provider",null,null,null,"TEST2"]

{"sheet":"DWP","index":3,"n_rows":211,"n_cols":10,"rows_kept":211,"cut":false,"hidden":true,"merged":[[209,1,209,5],[210,1,210,5],[211,1,211,5],[192,3,192,8],[194,3,194,8],[207,1,207,5],[208,1,208,5],[202,2,202,5],[180,3,180,8],[182,3,182,8],[186,3,186,8],[188,3,188,8],[190,3,190,8],[184,3,184,8],[22,1,23,9],[37,1,37,2],[37,3,37,8],[38,1,38,2],[38,3,38,8],[39,1,39,2],[39,3,39,8],[44,1,44,2],[44,3,44,8],[45,1,45,2],[45,3,45,8],[40,1,40,2],[40,3,40,8],[42,1,42,2],[42,3,42,8],[43,1,43,2],[43,3,43,8],[41,1,41,2],[41,3,41,8],[82,3,82,6],[47,1,47,2],[47,3,47,8],[80,3,80,6],[46,1,46,2],[46,3,46,8]]}
[]
[null,"Level Of Support Required:",null,null,{"$f":"CPA!N6","v":"Participation Statement not Completed DO NOT FORWARD"}]
[null,"Workless Household",null,null,{"$f":"CPA!M6","v":"Not Completed"}]
[]
[null,"Reducing Parental Conflict Programme"]
[null,"Referral Stage Questionnaire "]
[null,"For parents expecting their first child who are  no longer in a relationship"]
[null,"together/separated"]
[]
[null,"Please read the following instructions."]
[]
[null,"Please could you answer all questions in Part 1 asking for information relating to you "]
[null,"and your family."]
[]
[null,"Once you have provided your information please move on to Part 2. Please answer "]
[null,"all questions in this section."]
[]
[null,"Once completed please return the questionnaire to the person who gave it to "]
[null,"you."]
[]
[null,"Additional Needs - I have told the person who gave me this questionnaire about anything that might"]
[null,"make it difficult for me to take part (including any needs for interpreters etc.)"]
[null,{"$f":"Questionnaire!M25","v":"Must Complete"}]
[]
[]
[null,"Participation Agreement :",null,null,null,{"$f":"Questionnaire!M31","v":"Must Complete"}]
[]
[]
[null,"PART 1"]
[]
[null,"Parent information"]
[]
[null,"This section collects important information about you and your family."]
[null,"Please complete all questions in this section."]
[]
[null,"About You"]
[]
[null,null,null,"Please complete below"]
[null,"Title",null,{"$f":"Questionnaire!M54","v":"Must Complete"}]
[null,"Forenames",null,{"$f":"Questionnaire!M55","v":"Must Complete"}]
[null,"Surname",null,{"$f":"Questionnaire!M56","v":"Must Complete"}]
[null,"UIN",null,{"$f":"IF(CPA!I10>0, CPA!I10, \"INCOMPLETE\")","v":"TEST"}]
[null,"Date of birth\n(dd/mm/yyyy)",null,{"$f":"Questionnaire!M57","v":"Must Complete"}]
[null,"Telephone\nnumber (mobile)",null,{"$f":"Questionnaire!M58","v":"Must Complete"}]
[null,"Alternative\ntelephone \nnumber (e.g. landline)",null,{"$f":"Questionnaire!M59","v":"No alternative number supplied"}]
[null,"Address",null,{"$f":"Questionnaire!M60","v":"Must Complete"}]
[null,"Post code",null,{"$f":"Questionnaire!M61","v":"Must Complete"}]
[null,"Email",null,{"$f":"Questionnaire!M62","v":"No email address supplied"}]
[]
[null,"What is your gender identity? Please select below."]
[null,{"$f":"Questionnaire!M70","v":"Must Complete"}]
[]
[null,"Disability:"]
[null,{"$f":"Questionnaire!M78","v":"Must Complete"}]
[]
[null,"What is your ethnic group? Select one option that best describes your ethnic group "]
[null,"or background."]
[null,{"$f":"Questionnaire!M114","v":"Must Complete"},null,{"$f":"Questionnaire!L113","v":"None Selected"}]
[]
[]
[null,"Please answer the following questions by selecting your answer."]
[]
[null,"What is your marital status?"]
[null,{"$f":"Questionnaire!M129","v":"Must Complete"}]
[]
[null,"How many children do you have primary or shared care responsibility for?"]
[null,{"$f":"Questionnaire!M138","v":"Must Complete"}]
[]
[null,"Which of these best describes your current employment status?"]
[null,"Please note: if you are on parental leave, you should tick the box of the category you"]
[null,"were in prior to this leave."]
[null,{"$f":"Questionnaire!M155","v":"Must Complete"}]
[]
[null,"Are you presently or have you ever experienced mental health problems? "]
[null,{"$f":"Questionnaire!M166","v":"Must Complete"}]
[]
[null,"What is your relationship with the person you are currently experiencing"]
[null,"conflict with? "]
[null,{"$f":"Questionnaire!M178","v":"Must Complete"}]
[]
{"$rows_left_out":132}
{"sheet":"Provider","index":4,"n_rows":173,"n_cols":6,"rows_kept":173,"cut":false,"hidden":true,"merged":[[175,1,175,5],[168,3,168,8],[162,3,162,8],[164,3,164,8],[166,3,166,8],[172,1,173,9],[68,3,68,6],[46,1,46,2],[46,3,46,8],[47,1,47,2],[47,3,47,8],[48,1,48,2],[48,3,48,8],[49,1,49,2],[49,3,49,8],[66,3,66,6],[43,1,43,2],[43,3,43,8],[45,1,45,2],[45,3,45,8],[25,1,26,9],[40,1,40,2],[40,3,40,8],[41,1,41,2],[41,3,41,8],[42,1,42,2],[42,3,42,8],[44,1,44,2],[44,3,44,8]]}
[]
[null,"Level Of Support Required:",null,null,{"$f":"Admin!B15","v":"Participation Statement not Completed DO NOT FORWARD"}]
[null,"Workless Household",null,null,{"$f":"CPA!M6","v":"Not Completed"}]
[]
[null,"Reducing Parental Conflict Programme"]
[null,"Referral Stage Questionnaire "]
[null,"For parents expecting their first child who are  no longer in a relationship "]
[null,"together/separated"]
[]
[null,"Please read the following instructions."]
[]
[null,"Please could you answer all questions in Part 1 asking for information relating to you "]
[null,"and your family."]
[]
[null,"Once you have provided your information please move on to Part 2. Please answer "]
[null,"all questions in this section."]
[]
[null,"Once completed please return the questionnaire to the person who gave it to "]
[null,"you."]
[]
[null,"Additional Needs - I have told the person who gave me this questionnaire about anything that might"]
[null,"make it difficult for me to take part (including any needs for interpreters etc.)"]
[null,{"$f":"Questionnaire!M25","v":"Must Complete"}]
[]
[null,"Please give details"]
[null,{"$f":"Questionnaire!L28","v":"Additional Needs not entered"}]
[]
[]
[null,"Participation Agreement :",null,{"$f":"Questionnaire!M31","v":"Must Complete"}]
[]
[]
[null,"PART 1"]
[]
[null,"Parent information"]
[]
[null,"This section collects important information about you and your family."]
[null,"Please complete all questions in this section."]
[]
[null,"About You"]
[]
[null,null,null,"Please complete below"]
[null,"Title",null,{"$f":"Questionnaire!M54","v":"Must Complete"}]
[null,"Forenames",null,{"$f":"Questionnaire!M55","v":"Must Complete"}]
[null,"Surname",null,{"$f":"Questionnaire!M56","v":"Must Complete"}]
[null,"UIN",null,{"$f":"IF(CPA!I10>0, CPA!I10, \"INCOMPLETE\")","v":"TEST"}]
[null,"Telephone\nnumber (mobile)",null,{"$f":"Questionnaire!M58","v":"Must Complete"}]
[null,"Alternative\ntelephone \nnumber (e.g. landline)",null,{"$f":"Questionnaire!M59","v":"No alternative number supplied"}]
[null,"Address",null,{"$f":"Questionnaire!M60","v":"Must Complete"}]
[null,"Post code",null,{"$f":"Questionnaire!M61","v":"Must Complete"}]
[null,"Email",null,{"$f":"Questionnaire!M62","v":"No email address supplied"}]
[]
[null,"How many children do you have primary or shared care responsibility for?"]
[null,{"$f":"Questionnaire!M138","v":"Must Complete"}]
[]
[null,"Which of these best describes your current employment status?"]
[null,"Please note: if you are on parental leave, you should tick the box of the category you"]
[null,"were in prior to this leave."]
[null,{"$f":"Questionnaire!M155","v":"Must Complete"}]
[]
[null,"Are you presently or have you ever experienced mental health problems? "]
[null,{"$f":"Questionnaire!M166","v":"Must Complete"}]
[]
[null,"What is your relationship with the person you are currently experiencing"]
[null,"conflict with? "]
[null,{"$f":"Questionnaire!M178","v":"Must Complete"}]
[]
[null,"Their name",null,{"$f":"Questionnaire!M185","v":"Co-Parent details not supplied"}]
[]
[null,"Their UIN",null,{"$f":"IF(CPA!I13>0, CPA!I13, \"INCOMPLETE\")","v":"TEST2"}]
[]
[]
[null,"PART 2"]
[]
[]
[null,"Section 1:  Interacting with each other"]
[]
[null,"Considering the last 4 weeks, how often does the following occur between you and"]
[null,"your former (Ex) partner/spouse? Please answer as best as you can, selecting your "]
[null,"response for each question"]
[]
{"$rows_left_out":94}
{"sheet":"Scoring","index":5,"n_rows":41,"n_cols":8,"rows_kept":41,"cut":false,"hidden":true,"merged":[]}
["Scoring "]
[]
["Discuss & Share",null,"From Questionnaire","Numeric Value",null,"Conflict Level"]
["CONFLICT",1,{"$f":"Questionnaire!M214","v":"Must Complete"},{"$f":"IF(C4<>\"Must Complete\", C4, 0)","v":0},null,{"$f":"IF(D8>=8,\"None/Low\",IF(D8>=5,\"Moderate\",IF(D8>=0,\"High\",\"Error\")))","v":"High"},{"$f":"IF(F4=\"High\", 3, IF(F4=\"Moderate\", 2, IF(F4=\"None/Low\", 1, 0)))","v":3}]
[null,2,{"$f":"Questionnaire!M220","v":"Must Complete"},{"$f":"IF(C5<>\"Must Complete\", C5, 0)","v":0}]
[null,3,{"$f":"Questionnaire!M226","v":"Must Complete"},0]
[null,4,{"$f":"Questionnaire!M233","v":"Must Complete"},0]
[null,null,"Total",{"$f":"SUM(D4:D7)","v":0}]
[]
["SUPPORT",5,{"$f":"Questionnaire!M239","v":"Must Complete"},{"$f":"IF(C10<>\"Must Complete\", C10, 0)","v":0},null,{"$f":"IF(D13<=3,\"High\",IF(D13=4,\"Moderate\",IF(D13>=5,\"None/Low\",\"Error\")))","v":"High"},{"$f":"IF(F10=\"High\", 3, IF(F10=\"Moderate\", 2, IF(F10=\"None/Low\", 1, 0)))","v":3}]
[null,6,{"$f":"Questionnaire!M246","v":"Must Complete"},{"$f":"IF(C11<>\"Must Complete\", C11, 0)","v":0}]
[null,7,{"$f":"Questionnaire!M253","v":"Must Complete"},{"$f":"IF(C12<>\"Must Complete\", C12, 0)","v":0}]
[null,null,"Total",{"$f":"SUM(D10:D12)","v":0}]
[]
[]
["Conflict between parents"]
[null,1,{"$f":"Questionnaire!M265","v":"Must Complete"},{"$f":"IF(C17<>\"Must Complete\", C17, 0)","v":0}]
[null,2,{"$f":"Questionnaire!M271","v":"Must Complete"},{"$f":"IF(C18<>\"Must Complete\", C18, 0)","v":0}]
["COMMUNICATION",3,{"$f":"Questionnaire!M277","v":"Must Complete"},0]
[null,null,"Total",{"$f":"SUM(D17:D19)","v":0},null,{"$f":"IF(D20<=4,\"High\",IF(D20<=7,\"Moderate\",IF(D20>=8,\"None/Low\",\"Error\")))","v":"High"},{"$f":"IF(F20=\"High\", 3, IF(F20=\"Moderate\", 2, IF(F20=\"None/Low\", 1, 0)))","v":3}]
[]
[null,4,{"$f":"Questionnaire!M287","v":"Must Complete"},{"$f":"IF(C22<>\"Must Complete\", C22, 0)","v":0}]
["Frequency & Breadth",5,{"$f":"Questionnaire!M294","v":"Must Complete"},{"$f":"IF(C23<>\"Must Complete\", C23, 0)","v":0}]
["Breadth",6,{"$f":"Questionnaire!M301","v":"Must Complete"},0,"Often",{"$f":"COUNTIF(D22:D30, 3)","v":0}]
[null,7,{"$f":"Questionnaire!M308","v":"Must Complete"},0,"Sometimes",{"$f":"COUNTIF(D22:D30, 2)","v":0}]
[null,8,{"$f":"Questionnaire!M315","v":"Must Complete"},0,"Total",{"$f":"SUM(F24:F25)","v":0}]
[null,9,{"$f":"Questionnaire!M322","v":"Must Complete"},0]
[null,10,{"$f":"Questionnaire!M329","v":"Must Complete"},0,null,{"$f":"IF(F26>=7,\"High\",IF(F26>=5,\"Moderate\",IF(F26<=4,\"None/Low\",\"Error\")))","v":"None/Low"},{"$f":"IF(F28=\"High\", 3, IF(F28=\"Moderate\", 2, IF(F28=\"None/Low\", 1, 0)))","v":1},"BREADTH"]
[null,11,{"$f":"Questionnaire!M336","v":"Must Complete"},0]
[null,12,{"$f":"Questionnaire!M343","v":"Must Complete"},0]
[null,null,"Total",{"$f":"SUM(D22:D30)","v":0}]
[null,null,null,null,null,{"$f":"IF(D31>=18,\"High\",IF(D31>=13,\"Moderate\",IF(D31<=12,\"None/Low\",\"Error\")))","v":"None/Low"},{"$f":"IF(F32=\"High\", 3, IF(F32=\"Moderate\", 2, IF(F32=\"None/Low\", 1, 0)))","v":1},"FREQ"]
[]
[null,"D&S Conflict",{"$f":"G4","v":3}]
["Scores","D&S Support",{"$f":"G10","v":3}]
[null,"CBP Communication",{"$f":"G20","v":3}]
[null,"Frequency",{"$f":"G32","v":1}]
[null,"Breadth",{"$f":"G28","v":1}]
[null,"Highest Score",{"$f":"MAX(C34:C38)","v":3}]
[]
[null,null,null,null,"Amalgamated Score",{"$f":"C39","v":3},"Level of Conflict",{"$f":"IF(C39=3, \"High Intensity Support\", IF(C39=2, \"Moderate Intensity Support\", \"Other Support / None RPCP\"))","v":"High Intensity Support"}]