{"text_format":"1","workbook":"xlsx","n_sheets":6,"sheets":["Questionnaire","Admin","CPA","DWP","Provider","Scoring"],"not_rendered":{"charts":0,"images":0,"macros":1,"external_links":0,"defined_names":4,"comments":0,"pivot_tables":0},"unopened":[],"bounds":{"document_bytes":16777216,"sheet_cells":100000,"rows_first":2000,"rows_last":500,"rows_between":2000,"halvings":0,"cell_chars":16384,"cell_head_chars":4096},"cells_cut":0,"cells_raw":0,"read":"whole","date_system":"1900"}

{"sheet":"Questionnaire","index":0,"n_rows":517,"n_cols":14,"rows_kept":517,"cut":false,"hidden":false,"merged":[[138,1,138,7],[139,1,139,7],[26,1,27,9],[143,1,143,7],[144,1,144,7],[145,1,145,7],[146,1,146,7],[124,1,124,7],[125,1,125,7],[126,1,126,7],[130,1,130,7],[131,1,131,7],[132,1,132,7],[133,1,133,7],[134,1,134,7],[135,1,135,7],[120,1,120,7],[121,1,121,7],[107,1,107,7],[108,1,108,7],[109,1,109,7],[110,1,110,7],[111,1,111,7],[122,1,122,7],[123,1,123,7],[100,1,100,7],[101,1,101,7],[102,1,102,7],[103,1,103,7],[104,1,104,7],[105,1,105,7],[106,1,106,7],[118,1,118,7],[119,1,119,7],[91,1,91,7],[92,1,92,7],[93,1,93,7],[94,1,94,7],[95,1,95,7],[96,1,96,7],[97,1,97,7],[98,1,98,7],[99,1,99,7],[82,1,82,7],[83,1,83,7],[84,1,84,7],[85,1,85,7],[86,1,86,7],[87,1,87,7],[88,1,88,7],[89,1,89,7],[90,1,90,7],[58,1,58,2],[59,1,59,2],[65,1,65,6],[66,1,66,6],[67,1,67,6],[63,7,63,8],[64,7,64,8],[65,7,65,8],[66,7,66,8],[67,7,67,8],[64,1,64,6],[154,1,154,7],[155,1,155,7],[156,1,156,7],[157,1,157,7],[158,1,158,7],[55,3,55,8],[50,1,50,2],[51,1,51,2],[52,1,52,2],[53,1,53,2],[54,1,54,2],[55,1,55,2],[50,3,50,8],[51,3,51,8],[52,3,52,8],[53,3,53,8],[54,3,54,8],[56,3,56,8],[57,3,57,8],[58,3,58,8],[59,3,59,8],[63,1,63,6],[56,1,56,2],[57,1,57,2],[164,1,164,7],[170,1,170,7],[171,1,171,7],[172,1,172,7],[173,1,173,7],[159,1,159,7],[160,1,160,7],[161,1,161,7],[162,1,162,7],[163,1,163,7],[184,1,184,7],[185,1,185,7],[186,1,186,7],[187,1,187,7],[174,1,174,7],[175,1,175,7],[181,1,181,7],[182,1,182,7],[183,1,183,7],[512,1,513,9],[463,3,463,8],[465,3,465,8],[469,3,469,8],[194,3,194,6],[196,3,196,6],[473,3,473,8],[475,3,475,8],[477,3,477,8],[479,3,479,8],[467,3,467,8],[504,1,504,5],[505,1,505,5],[506,1,506,5],[507,1,507,5],[508,1,508,5],[471,3,471,8],[497,4,497,7]]}
[null,null,null,null,null,null,null,null,null,null,"v5"]
[]
[null,"Reducing Parental Conflict Programme"]
[null,"Referral Stage Questionnaire "]
[null,"For parents who are  no longer in a relationship together/separated"]
[]
[]
[null,"Please read the following instructions."]
[]
[null,"Please could you answer all questions in Part 1 asking for information relating to you ",null,null,null,null,null,null,null,null,null,"Values"]
[null,"and your family."]
[]
[null,"Once you have provided your information please move on to Part 2. Please answer "]
[null,"all questions in this section."]
[]
[null,"Once completed please return the questionnaire to the person who gave it to "]
[null,"you"]
[]
[null,"Additional Needs (including any needs for interpreters etc.)"]
[]
[null,"I have no additional needs that might make it difficult for me to take part"]
[]
[null,"I have additional needs that might make it difficult for me to take part. "]
[null,"I have given details of these below:"]
[null,null,null,null,null,null,null,null,null,null,null,0,{"$f":"IF(L25=1, \"No Additional Needs Identified\", IF(L25=2, \"Additional Needs Identified\", \"Must Complete\"))","v":"Must Complete"}]
[null,"Please give details"]
[]
[null,null,null,null,null,null,null,null,null,null,null,{"$f":"IF(B27>0, B27, \"Additional Needs not entered\")","v":"Additional Needs not entered"},{"$f":"IF(B27>0, \"Additional Needs Entered\", \"Additional Needs not entered\")","v":"Additional Needs not entered"}]
[]
[null,"I have completed a separate Participation Agreement with the person who gave me the "]
[null,"questionnaire",null,null,null,null,null,null,null,null,null,false,{"$f":"IF(L31=TRUE, \"Participation Agreement Completed\", \"Must Complete\")","v":"Must Complete"}]
[]
[null,"If you are completing a paper copy of this questionnaire, please select just one answer "]
[null,"for multiple choice questions."]
[]
[null,"Is anyone within your household currently in work?"]
[null,"Yes"]
[null,"No",null,null,null,null,null,null,null,null,null,0,{"$f":"IF(L38=1, \"Yes\", IF(L38=2, \"No\", \"Must Complete\"))","v":"Must Complete"}]
[]
[]
[]
[null,"PART 1"]
[]
[null,"Parent information"]
[]
[null,"This section collects important information about you and your family."]
[null,"Please complete all questions in this section."]
[]
[null,"About You"]
[]
[null,null,null,"Please complete below"]
[null,"Title",null,null,null,null,null,null,null,null,null,null,{"$f":"IF(D52>0, D52,\"Must Complete\")","v":"Must Complete"}]
[null,"Forenames",null,null,null,null,null,null,null,null,null,null,"Must Complete"]
[null,"Surname",null,null,null,null,null,null,null,null,null,null,"Must Complete"]
[null,"Date of birth\n(dd/mm/yyyy)",null,null,null,null,null,null,null,null,null,null,"Must Complete"]
[null,"Telephone\nnumber (mobile)",null,null,null,null,null,null,null,null,null,null,{"$f":"IF(D56>0, \"+44 \"&D56,\"Must Complete\")","v":"Must Complete"}]
[null,"Alternative\ntelephone \nnumber (e.g. landline)",null,null,null,null,null,null,null,null,null,null,{"$f":"IF(D57>0,\"+44\" &D57,\"No alternative number supplied\")","v":"No alternative number supplied"}]
[null,"Address",null,null,null,null,null,null,null,null,null,null,"Must Complete"]
[null,"Post code",null,null,null,null,null,null,null,null,null,null,"Must Complete"]
[null,"Email",null,null,null,null,null,null,null,null,null,null,{"$f":"IF(D60>0, D60, \"No email address supplied\")","v":"No email address supplied"}]
[]
[null,"What is your gender identity? Please select below."]
[]
[]
[null,"Male"]
[null,"Female"]
[null,"Other"]
[null,"Prefer not to say",null,null,null,null,null,null,null,null,null,0,{"$f":"IF(L68=0,\"Must Complete\",IF(L68=1,\"Prefer not to say\",IF(L68=2,\"Other\",IF(L68=3,\"Female\",IF(L68=4,\"Male\",\"INCORRECT\")))))","v":"Must Complete"}]
[]
[null,"Disability:"]
[null,"Do you have a long-standing physical or mental impairment, illness or disability? By "]
[null,"long-standing' we mean anything that has troubled you over a period of at least 12 "]
[null,"months or that is likely to trouble you over a period of at least 12 months."]
[]
[]
[null,"Yes",null,"No ",null,"Prefer not to say",null,null,null,null,null,0,{"$f":"IF(L76=0, \"Must Complete\", IF(L76=1, \"Prefer not to say\", IF(L76=2, \"No\", IF(L76=3, \"Yes\",\"Incorrect\"))))","v":"Must Complete"}]
[]
[]
[]
[null,"What is your ethnic group? Select one option that best describes your ethnic group "]
{"$rows_left_out":438}
{"sheet":"Admin","index":1,"n_rows":18,"n_cols":10,"rows_kept":18,"cut":false,"hidden":false,"merged":[]}
[]
["***** FOR ADMINISTRATION USE ONLY ******"]
[]
["CPA Email","rpcgateway@gateshead.gov.uk"]
[]
["DWP Email","RPC.REFERRALTEAM@DWP.GOV.UK"]
[]
["Provider Email","RPC@relate.org.uk"]
[]
[]
[]
[]
[]
[null,"Level Calculated"]
[null,{"$f":"IF(Questionnaire!L31,Scoring!H50, \"Participation Statement not Completed DO NOT FORWARD\")","v":"Participation Statement not Completed DO NOT FORWARD"}]
[]
[null,{"$f":"\"RSQ -  \"&B15","v":"RSQ -  Participation Statement not Completed DO NOT FORWARD"}]
[null,{"$f":"CPA!I9","v":"TEST"},null,null,null,null,null,null,null,{"$f":"CPA!I9","v":"TEST"}]

{"sheet":"CPA","index":2,"n_rows":13,"n_cols":15,"rows_kept":13,"cut":false,"hidden":true,"merged":[]}
[]
[" Tab for CPA Admin Use Only"]
[]
[]
["Date RSQ Completed","Parent Name","Date of Birth","Phone Number","Practitioner","Role","Team","Service","Organisation","Email","Phone","LA","Workless Household","Support Level","Main Carer"]
[{"$f":"Questionnaire!M478","v":"Must Complete"},{"$f":"Questionnaire!M52&\" \"&Questionnaire!M53&\" \"&Questionnaire!M54","v":"Must Complete Must Complete Must Complete"},{"$f":"Questionnaire!M55","v":"Must Complete"},{"$f":"Questionnaire!M56","v":"Must Complete"},{"$f":"Questionnaire!M464","v":"Must Complete"},{"$f":"Questionnaire!M466","v":"Must Complete"},{"$f":"Questionnaire!M468","v":"Must Complete"},{"$f":"Questionnaire!M470","v":"Must Complete"},{"$f":"Questionnaire!M472","v":"Must Complete"},{"$f":"Questionnaire!M474","v":"Must Complete"},{"$f":"Questionnaire!M476","v":"Must Complete"},{"$f":"Questionnaire!M480","v":"Must Complete"},{"$f":"IF(Questionnaire!M38=\"Yes\", \"No\", IF(Questionnaire!M38=\"No\", \"Yes\", \"Not Completed\"))","v":"Not Completed"},{"$f":"Admin!B15","v":"Participation Statement not Completed DO NOT FORWARD"},{"$f":"IF(Questionnaire!$L140=1, \"Yes\", IF(Questionnaire!$L140=2, \"No\", \"Must Complete\"))","v":"Must Complete"}]
[null,null,null,null,null,null,null,null,"Enter UIN Below"]
[null,"Linked Co-Parent"]
[null,{"$f":"Questionnaire!M195","v":"Co-Parent details not supplied"},{"$f":"Questionnaire!M197","v":"Co-Parent details not supplied"},null,null,null,null,null,"TEST",null,"*Copy and paste yellow cell data to UIN spreadsheet "]
[null,null,null,null,null,null,null,null,null,null,"to assign a UIN"]
[null,null,null,null," Use this button  to send the full RSQ to DWP"]
[null,null,null,null,null,null,null,null,"JY"]
[null,null,null,null," Use this button to send RSQ data to the Provider"]

{"sheet":"DWP","index":3,"n_rows":257,"n_cols":10,"rows_kept":257,"cut":false,"hidden":true,"merged":[[247,2,247,5],[256,1,256,5],[252,1,252,5],[253,1,253,5],[254,1,254,5],[255,1,255,5],[22,1,22,9],[37,1,37,2],[37,3,37,8],[38,1,38,2],[38,3,38,8],[39,1,39,2],[39,3,39,8],[44,1,44,2],[44,3,44,8],[45,1,45,2],[45,3,45,8],[46,1,46,2],[46,3,46,8],[40,1,40,2],[40,3,40,8],[42,1,42,2],[42,3,42,8],[43,1,43,2],[43,3,43,8],[41,1,41,2],[41,3,41,8],[47,1,47,2],[47,3,47,8],[83,3,83,6],[85,3,85,6],[222,3,222,8],[238,3,238,8],[224,3,224,8],[226,3,226,8],[232,3,232,8],[234,3,234,8],[236,3,236,8],[228,3,228,8],[230,3,230,8]]}
[]
[null,"Level Of Support Required:",null,null,{"$f":"CPA!N6","v":"Participation Statement not Completed DO NOT FORWARD"}]
[null,"Workless Household",null,null,{"$f":"CPA!M6","v":"Not Completed"}]
[]
[null,"Reducing Parental Conflict Programme"]
[null,"Referral Stage Questionnaire "]
[null,"For parents who are  no longer in a relationship together/separated"]
[]
[]
[null,"Please read the following instructions."]
[]
[null,"Please could you answer all questions in Part 1 asking for information relating to you "]
[null,"and your family."]
[]
[null,"Once you have provided your information please move on to Part 2. Please answer "]
[null,"all questions in this section."]
[]
[null,"Once completed please return the questionnaire to the person who gave it to "]
[null,"you"]
[]
[null,"Additional Needs - I have told the person who gave me this questionnaire about anything that might"]
[null,"make it difficult for me to take part (including any needs for interpreters etc.)"]
[null,{"$f":"Questionnaire!M25","v":"Must Complete"}]
[null,{"$f":"Questionnaire!M28","v":"Additional Needs not entered"}]
[]
[null,"Participation Agreement :",null,null,null,{"$f":"Questionnaire!M31","v":"Must Complete"}]
[]
[]
[null,"PART 1"]
[]
[null,"Parent information"]
[]
[null,"This section collects important information about you and your family."]
[null,"Please complete all questions in this section."]
[]
[null,"About You"]
[]
[null,null,null,"Please complete below"]
[null,"Title",null,{"$f":"Questionnaire!M52","v":"Must Complete"}]
[null,"Forenames",null,{"$f":"Questionnaire!M53","v":"Must Complete"}]
[null,"Surname",null,{"$f":"Questionnaire!M54","v":"Must Complete"}]
[null,"UIN",null,{"$f":"IF(CPA!I9>0, CPA!I9, \"INCOMPLETE\")","v":"TEST"}]
[null,"Date of birth\n(dd/mm/yyyy)",null,{"$f":"Questionnaire!M55","v":"Must Complete"}]
[null,"Telephone\nnumber (mobile)",null,{"$f":"Questionnaire!M56","v":"Must Complete"}]
[null,"Alternative\ntelephone \nnumber (e.g. landline)",null,{"$f":"Questionnaire!M57","v":"No alternative number supplied"}]
[null,"Address",null,{"$f":"Questionnaire!M58","v":"Must Complete"}]
[null,"Post code",null,{"$f":"Questionnaire!M59","v":"Must Complete"}]
[null,"Email",null,{"$f":"Questionnaire!M60","v":"No email address supplied"}]
[]
[null,"What is your gender identity? Please select below."]
[null,{"$f":"Questionnaire!M68","v":"Must Complete"}]
[]
[null,"Disability:"]
[null,{"$f":"Questionnaire!M76","v":"Must Complete"}]
[]
[null,"What is your ethnic group? Select one option that best describes your ethnic group "]
[null,"or background."]
[null,{"$f":"Questionnaire!M113","v":"Must Complete"},null,{"$f":"Questionnaire!N113","v":"None Selected"}]
[]
[]
[null,"Please answer the following questions by selecting your answer."]
[]
[null,"What is your marital status?"]
[null,{"$f":"Questionnaire!M127","v":"Must Complete"}]
[]
[null,"How many children do you have primary or shared care responsibility for?"]
[null,{"$f":"Questionnaire!M136","v":"Must Complete"}]
[]
[null,"Are you or your partner pregnant now?"]
[null,{"$f":"Questionnaire!M147","v":"Must Complete"}]
[]
[null,"Which of these best describes your current employment status?"]
[null,"Please note: if you are on parental leave, you should tick the box of the category you"]
[null,"were in prior to this leave."]
[null,{"$f":"Questionnaire!M165","v":"Must Complete"}]
[]
[null,"Are you presently or have you ever experienced mental health problems? "]
[null,{"$f":"Questionnaire!M176","v":"Must Complete"}]
[]
[null,"What is your relationship with the person you are currently experiencing"]
{"$rows_left_out":178}
{"sheet":"Provider","index":4,"n_rows":217,"n_cols":6,"rows_kept":217,"cut":false,"hidden":true,"merged":[[216,1,217,9],[206,3,206,8],[208,3,208,8],[210,3,210,8],[212,3,212,8],[70,3,70,6],[48,1,48,2],[48,3,48,8],[68,3,68,6],[42,1,42,2],[42,3,42,8],[44,1,44,2],[44,3,44,8],[45,1,45,2],[45,3,45,8],[46,1,46,2],[46,3,46,8],[47,1,47,2],[47,3,47,8],[41,1,41,2],[41,3,41,8],[43,1,43,2],[43,3,43,8],[24,1,25,9],[39,1,39,2],[39,3,39,8],[40,1,40,2],[40,3,40,8]]}
[]
[null,"Level Of Support Required:",null,null,{"$f":"CPA!N6","v":"Participation Statement not Completed DO NOT FORWARD"}]
[null,"Workless Household",null,null,{"$f":"CPA!M6","v":"Not Completed"}]
[]
[null,"Reducing Parental Conflict Programme"]
[null,"Referral Stage Questionnaire "]
[null,"For parents who are  no longer in a relationship together/separated"]
[]
[]
[null,"Please read the following instructions."]
[]
[null,"Please could you answer all questions in Part 1 asking for information relating to you "]
[null,"and your family."]
[]
[null,"Once you have provided your information please move on to Part 2. Please answer "]
[null,"all questions in this section."]
[]
[null,"Once completed please return the questionnaire to the person who gave it to "]
[null,"you"]
[]
[null,"Additional Needs - I have told the person who gave me this questionnaire about anything that might"]
[null,"make it difficult for me to take part (including any needs for interpreters etc.)"]
[]
[null,"Please give details"]
[null,{"$f":"IF(Questionnaire!B27>0, Questionnaire!B27, \"INCOMPLETE\")","v":"INCOMPLETE"}]
[]
[]
[null,"Participation Agreement :",null,null,{"$f":"Questionnaire!M31","v":"Must Complete"}]
[null,"questionnaire"]
[]
[null,"PART 1"]
[]
[null,"Parent information"]
[]
[null,"This section collects important information about you and your family."]
[null,"Please complete all questions in this section."]
[]
[null,"About You"]
[]
[null,null,null,"Please complete below"]
[null,"Title",null,{"$f":"Questionnaire!M52","v":"Must Complete"}]
[null,"Forenames",null,{"$f":"Questionnaire!M53","v":"Must Complete"}]
[null,"Surname",null,{"$f":"Questionnaire!M54","v":"Must Complete"}]
[null,"UIN",null,{"$f":"IF(CPA!I9>0, CPA!I9,\"INCOMPLETE\")","v":"TEST"}]
[null,"Telephone\nnumber (mobile)",null,{"$f":"Questionnaire!M56","v":"Must Complete"}]
[null,"Alternative\ntelephone \nnumber (e.g. landline)",null,{"$f":"Questionnaire!M57","v":"No alternative number supplied"}]
[null,"Address",null,{"$f":"Questionnaire!M58","v":"Must Complete"}]
[null,"Post code",null,{"$f":"Questionnaire!M59","v":"Must Complete"}]
[null,"Email",null,{"$f":"Questionnaire!M60","v":"No email address supplied"}]
[]
[null,"How many children do you have primary or shared care responsibility for?"]
[null,{"$f":"Questionnaire!M136","v":"Must Complete"}]
[]
[null,"Are you or your partner pregnant now?"]
[null,{"$f":"Questionnaire!M147","v":"Must Complete"}]
[]
[null,"Which of these best describes your current employment status?"]
[null,"Please note: if you are on parental leave, you should tick the box of the category you"]
[null,"were in prior to this leave."]
[null,{"$f":"Questionnaire!M165","v":"Must Complete"}]
[]
[null,"Are you presently or have you ever experienced mental health problems? "]
[null,{"$f":"Questionnaire!M176","v":"Must Complete"}]
[]
[null,"What is your relationship with the person you are currently experiencing"]
[null,"conflict with? "]
[null,{"$f":"Questionnaire!M188","v":"Must Complete"}]
[]
[null,"Their name",null,{"$f":"Questionnaire!M195","v":"Co-Parent details not supplied"}]
[]
[null,"Their UIN",null,{"$f":"IF(CPA!I12>0, CPA!I12,\"INCOMPLETE\")","v":"JY"}]
[]
[]
[null,"PART 2"]
[null,"Questionnaire for parents who are no longer in a"]
[null,"relationship together / separated"]
[]
[null,"Important: Please only answer these questions if you are no longer  in a "]
[null,"relationship together / have separated from with the parent with whom "]
[null,"you are experiencing conflict. "]
{"$rows_left_out":138}
{"sheet":"Scoring","index":5,"n_rows":50,"n_cols":8,"rows_kept":50,"cut":false,"hidden":true,"merged":[]}
["Scoring "]
[]
["Discuss & Share",null,"From Questionnaire","Numeric Value",null,"Conflict Level"]
["CONFLICT",1,{"$f":"Questionnaire!M224","v":"Must Complete"},{"$f":"IF(C4<>\"Must Complete\", C4, 0)","v":0},null,{"$f":"IF(D8>=8,\"None/Low\",IF(D8>=5,\"Moderate\",IF(D8<=4,\"High\",\"Error\")))","v":"High"},{"$f":"IF(F4=\"High\", 3, IF(F4=\"Moderate\", 2, IF(F4=\"None/Low\", 1, 0)))","v":3}]
[null,2,{"$f":"Questionnaire!M230","v":"Must Complete"},{"$f":"IF(C5<>\"Must Complete\", C5, 0)","v":0}]
[null,3,{"$f":"Questionnaire!M236","v":"Must Complete"},0]
[null,4,{"$f":"Questionnaire!M243","v":"Must Complete"},0]
[null,null,"Total",{"$f":"SUM(D4:D7)","v":0}]
[]
["SUPPORT",5,{"$f":"Questionnaire!M250","v":"Must Complete"},{"$f":"IF(C10<>\"Must Complete\", C10, 0)","v":0},null,{"$f":"IF(D16<=6,\"High\",IF(D16=7,\"Moderate\",IF(D16>=8,\"None/Low\",\"Error\")))","v":"High"},{"$f":"IF(F10=\"High\", 3, IF(F10=\"Moderate\", 2, IF(F10=\"None/Low\", 1, 0)))","v":3}]
[null,6,{"$f":"Questionnaire!M256","v":"Must Complete"},{"$f":"IF(C11<>\"Must Complete\", C11, 0)","v":0}]
[null,7,{"$f":"Questionnaire!M262","v":"Must Complete"},0]
[null,8,{"$f":"Questionnaire!M269","v":"Must Complete"},0]
[null,9,{"$f":"Questionnaire!M276","v":"Must Complete"},0]
[null,10,{"$f":"Questionnaire!M283","v":"Must Complete"},0]
[null,null,"Total",{"$f":"SUM(D10:D15)","v":0}]
[]
["Conflict between parents"]
["COMMUNICATION"]
[null,1,{"$f":"Questionnaire!M295","v":"Must Complete"},{"$f":"IF(C20<>\"Must Complete\", C20, 0)","v":0},null,{"$f":"IF(D23<=4,\"High\",IF(D23<=7,\"Moderate\",IF(D23>=8,\"None/Low\",\"Error\")))","v":"High"},{"$f":"IF(F20=\"High\", 3, IF(F20=\"Moderate\", 2, IF(F20=\"None/Low\", 1, 0)))","v":3}]
[null,2,{"$f":"Questionnaire!M301","v":"Must Complete"},{"$f":"IF(C21<>\"Must Complete\", C21, 0)","v":0}]
[null,3,{"$f":"Questionnaire!M307","v":"Must Complete"},0]
[null,null,"Total",{"$f":"SUM(D20:D22)","v":0}]
[]
[null,4,{"$f":"Questionnaire!M315","v":"Must Complete"},{"$f":"IF(C25<>\"Must Complete\", C25, 0)","v":0}]
["SATISFACTION",5,{"$f":"Questionnaire!M321","v":"Must Complete"},{"$f":"IF(C26<>\"Must Complete\", C26, 0)","v":0}]
[null,6,{"$f":"Questionnaire!M327","v":"Must Complete"},0]
[null,7,{"$f":"Questionnaire!M333","v":"Must Complete"},0]
[null,8,{"$f":"Questionnaire!M339","v":"Must Complete"},0,null,{"$f":"IF(D30<=8,\"High\",IF(D30<=12,\"Moderate\",IF(D30>=13,\"None/Low\",\"Error\")))","v":"High"},{"$f":"IF(F29=\"High\", 3, IF(F29=\"Moderate\", 2, IF(F29=\"None/Low\", 1, 0)))","v":3}]
[null,null,"Total",{"$f":"SUM(D25:D29)","v":0}]
[]
["Frequency & Breadth"]
[null,9,{"$f":"Questionnaire!M348","v":"Must Complete"},{"$f":"IF(C33<>\"Must Complete\", C33, 0)","v":0},"Often",{"$f":"COUNTIF(D33:D41, 3)","v":0}]
[null,10,{"$f":"Questionnaire!M355","v":"Must Complete"},{"$f":"IF(C34<>\"Must Complete\", C34, 0)","v":0},"Sometimes",{"$f":"COUNTIF(D33:D41, 2)","v":0}]
[null,11,{"$f":"Questionnaire!M362","v":"Must Complete"},0,"Total",{"$f":"SUM(F33:F34)","v":0}]
[null,12,{"$f":"Questionnaire!M369","v":"Must Complete"},0]
[null,13,{"$f":"Questionnaire!M376","v":"Must Complete"},0,null,{"$f":"IF(F35>=7,\"High\",IF(F35>=5,\"Moderate\",IF(F35<=4,\"None/Low\",\"Error\")))","v":"None/Low"},{"$f":"IF(F37=\"High\", 3, IF(F37=\"Moderate\", 2, IF(F37=\"None/Low\", 1, 0)))","v":1},"BREADTH"]
[null,14,{"$f":"Questionnaire!M383","v":"Must Complete"},0]
[null,15,{"$f":"Questionnaire!M390","v":"Must Complete"},0]
[null,16,{"$f":"Questionnaire!M397","v":"Must Complete"},0,null,{"$f":"IF(D42>=18,\"High\",IF(D42>=13,\"Moderate\",IF(D42<=12,\"None/Low\",\"Error\")))","v":"None/Low"},{"$f":"IF(F40=\"High\", 3, IF(F40=\"Moderate\", 2, IF(F40=\"None/Low\", 1, 0)))","v":1},"FREQ"]
[null,17,{"$f":"Questionnaire!M404","v":"Must Complete"},0]
[null,null,"Total",{"$f":"SUM(D33:D41)","v":0}]
["Scores"]
[null,"D&S Conflict",{"$f":"G4","v":3}]
[null,"D&S Support",{"$f":"G10","v":3}]
[null,"CBP Communication",{"$f":"G20","v":3}]
[null,"CBP Satisfaction",{"$f":"G29","v":3}]
[null,"Frequency",{"$f":"G40","v":1}]
[null,"Breadth",{"$f":"G37","v":1}]
[null,"Highest Score",{"$f":"MAX(C44:C49)","v":3},null,"Amalgamated Score",{"$f":"MAX(C44:C49)","v":3},"Level of Conflict",{"$f":"IF(F50=3, \"High Intensity Support\", IF(F50=2, \"Moderate Intensity Support\", \"Other Support / None RPCP\"))","v":"High Intensity Support"}]